program: Gaussian 09
title: 000297293
version: EM64L-G09RevD.01
frameworkgroup: C1[X(C12H14N2O3)]
method: RPBEPBE
basis: SDD
operation: Freq
keyword: #p
keyword: freq=noraman
keyword: PBEPBE/SDD
title: #p freq=noraman PBEPBE/SDD
converged: YES YES NO NO
title: Mulliken charges:
elementType: O O O N N C C C C C C C C C C C C H H H H H H H H H H H H H H
charge: -0.244736 -0.296107 -0.293924 -0.338621 -0.135294 -0.167909 -0.054798 -0.707714 0.252737 0.234703 0.265676 -0.302256 -0.466000 -0.376316 -0.374858 -0.223069 -0.226566 0.282642 0.249110 0.352660 0.218739 0.238699 0.235090 0.231447 0.227956 0.228853 0.232581 0.251168 0.248367 0.228856 0.228883
chargesum: 0.00000
title: Mulliken charges with hydrogens summed into heavy atoms:
elementType: O O O N N C C C C C C C C C C C C
charge: -0.244736 -0.296107 -0.293924 0.014040 -0.135294 0.114734 0.194313 -0.015185 0.252737 0.234703 0.265676 0.157147 -0.004567 -0.125148 -0.126491 0.005786 0.002317
polarizability: 1.89904463e+02 1.50203170e+01 1.42426952e+02 -1.95355736e+01 7.56575331e+00 1.19007322e+02
1716.lowfreq: -7.9523 -4.6418 0.0004 0.0006 0.0008 17.4571 30.5142 49.7268 60.6890
frequency: 29.6864 49.5687 60.6604 66.4433 90.6196 141.5745 175.4912 181.5143 200.9153 241.8102 243.2243 293.0837 358.8767 404.5628 406.2008 450.4588 477.4062 518.0608 534.2267 543.1758 578.8810 608.6323 644.4213 672.3601 712.4579 719.4778 723.4132 755.4707 770.4477 798.3398 817.4572 840.0475 850.1739 868.9893 885.2775 920.0020 925.8219 933.6975 943.1174 967.7160 1004.0460 1022.3879 1025.9670 1079.0255 1082.5922 1090.7086 1140.7285 1151.5260 1157.6761 1160.8223 1180.4768 1200.4337 1221.0550 1229.9378 1265.2670 1282.1995 1302.7616 1314.3397 1323.0125 1340.9326 1358.5628 1390.3005 1396.5954 1444.8062 1464.1528 1470.2814 1471.9682 1476.9638 1488.6301 1499.8475 1592.2327 1612.7492 1676.8614 3000.0996 3002.9780 3005.0916 3031.8464 3050.3934 3097.7034 3103.9963 3110.3208 3111.7453 3137.2549 3150.7037 3163.3527 3175.2494 3557.1565
redmass: 4.9019 3.9251 3.0907 3.4199 4.1693 4.7708 2.5675 3.8282 1.3153 3.7635 4.0886 5.5736 5.7975 4.6226 3.8979 3.2401 5.6619 1.8712 4.8352 2.9012 4.0140 3.3754 8.6033 7.2099 4.5641 5.1209 5.5003 1.2512 4.7773 4.6357 1.1732 4.1047 1.4042 7.2731 7.1881 3.4721 2.9370 1.3688 5.2668 1.2934 3.2726 2.1494 1.9638 2.7494 1.5842 2.4090 2.5692 1.6987 1.0997 1.1012 2.7506 1.1096 2.7583 2.5610 1.4664 1.4058 1.2887 1.3159 1.2732 1.6428 1.3455 5.3752 1.2821 2.5428 1.0675 2.3970 1.0891 1.1148 1.1443 1.7364 7.5040 7.2114 9.4410 1.0390 1.0586 1.0826 1.0584 1.1072 1.0986 1.1114 1.1005 1.0884 1.0852 1.0899 1.0948 1.1006 1.0770
irintensity: 0.3708 1.4523 1.3199 0.3296 4.7657 1.6353 3.2760 3.0609 1.2923 3.8699 1.1118 0.7440 5.6265 3.8449 4.3115 12.3968 19.6902 43.3443 12.1767 17.4710 31.6312 11.0553 17.8982 7.3761 3.0714 3.9107 7.1608 108.7074 4.8013 29.6850 0.5369 49.8264 0.4775 10.1219 315.1139 44.6831 16.6805 6.2100 42.2160 0.0344 62.8749 7.6204 36.0481 45.9054 0.1848 29.5849 19.0554 8.6317 0.7594 10.6111 28.6895 2.7107 173.7398 128.0318 1.6887 27.3181 8.4286 21.4889 38.9974 32.1932 8.9450 12.0477 30.2188 9.0175 13.4314 208.8358 35.2152 1.9770 20.3747 251.0300 20.4680 9.8096 515.1721 13.4315 65.2035 28.3569 66.2649 14.9755 15.4519 37.0269 21.5688 9.4447 1.4054 12.8988 14.0221 15.0619 55.9466
temp: 298.150 k
press: 1.00000 atm
elementType: 8 8 8 7 7 6 6 6 6 6 6 6 6 6 6 6 6 1 1 1 1 1 1 1 1 1 1 1 1 1 1
symmnumber: 1
zpe: 646112.1 jmol-1
zpe.correction: 0.246091 hartree
zpe.thermalcorrener: 0.261093 hartree
zpe.thermalcorrenthalpy: 0.262037 hartree
zpe.thermalcorrgfe: 0.202662 hartree
zpe.sumelectzpe: -799.567196 hartree
zpe.sumelectthermal: -799.552195 hartree
zpe.sumelectthermalent: -799.551250 hartree
zpe.sumelectthermalfe: -799.610625 hartree
dipole: 1.4757 0.6459 0.9546
dipole: 1.8725
quadrupole: -84.4651 -90.2714 -104.1835
quadrupole: -1.3406 1.8375 -1.6944
quadrupole: 8.5082 2.7019 -11.2101 -1.3406 1.8375 -1.6944
hfenergy: -799.8132875 hartree
pointgroup: C01 [X(C12H14N2O3)]
dipole: -0.5802874 -0.2540909 0.3760874 debye
polarizability: 190.5434851|14.1065805|142.3615139|19.1081779|-7.4985328|118.4337379 unknown
InChI: InChI=1S/C12H14N2O3/c1-8-11(14-12-13-6-7-15-12)17-10-5-3-2-4-9(10)16-8/h2-5,8,11,14H,6-7H2,1H3
charge 0 multiplicity 1
31 atoms
O  0.448444 0.250191 -1.408253
O  1.383064 -1.614731 0.62298
O  -2.917199 0.652096 1.424085
N  -1.16688 -0.421867 0.304538
N  -3.142425 0.287685 -0.884427
C  -0.418217 -0.846292 -0.848094
C  0.499115 -2.040846 -0.50382
C  -0.230367 -3.297634 -0.046347
C  1.616048 0.49704 -0.651341
C  2.078385 -0.405669 0.345013
C  -2.411104 0.163134 0.189969
C  -4.271667 1.202248 1.085023
C  -4.399097 0.983421 -0.466434
C  2.33507 1.682912 -0.907161
C  3.233784 -0.110955 1.094308
C  3.500166 1.973429 -0.165202
C  3.945184 1.082594 0.842217
H  -1.111927 -1.058325 -1.67496
H  1.138263 -2.243622 -1.385939
H  -0.720634 -0.441943 1.223398
H  -0.866488 -3.688553 -0.860347
H  0.500955 -4.075608 0.229794
H  -0.870728 -3.087604 0.826538
H  -4.277974 2.262523 1.385015
H  -5.012725 0.63608 1.673017
H  -5.274571 0.360343 -0.723068
H  -4.491704 1.940788 -1.010197
H  1.96034 2.363208 -1.678259
H  3.561638 -0.825413 1.856168
H  4.053914 2.89608 -0.367658
H  4.844438 1.310696 1.423542
