program: Gaussian 09
title: 000297289
version: EM64L-G09RevD.01
frameworkgroup: C1[X(C9H15NO2)]
method: RPBEPBE
basis: SDD
operation: Freq
keyword: #p
keyword: freq=noraman
keyword: PBEPBE/SDD
title: #p freq=noraman PBEPBE/SDD
converged: YES YES NO NO
title: Mulliken charges:
elementType: O O N C C C C C C C C C H H H H H H H H H H H H H H H
charge: -0.272526 -0.236644 -0.006684 -0.275317 -0.449806 -0.422390 0.123704 -0.491071 0.245972 -0.772039 -0.266157 -0.665094 0.256125 0.213534 0.230375 0.262782 0.203856 0.233782 0.218546 0.222104 0.251027 0.241417 0.224009 0.235703 0.219694 0.251271 0.223827
chargesum: 0.00000
title: Mulliken charges with hydrogens summed into heavy atoms:
elementType: O O N C C C C C C C C C
charge: -0.272526 -0.236644 -0.006684 -0.019192 -0.005898 0.044249 0.123704 -0.038744 0.245972 -0.057491 0.193556 0.029698
polarizability: 1.37080822e+02 4.27341611e+00 1.01286373e+02 8.83269166e+00 2.81336727e+00 8.94665349e+01
1716.lowfreq: -2.2593 -0.0007 -0.0006 0.0004 7.5892 11.3323 26.8287 59.6163 67.1580
frequency: 26.6511 59.5798 67.1470 81.3954 129.9109 162.6859 187.7363 220.1261 256.4135 273.2660 303.4526 323.6151 348.7654 428.3678 439.9658 488.1081 539.7237 614.0509 675.1336 687.6178 772.7397 804.1009 822.5562 833.0767 852.8713 876.8874 894.8866 950.6803 1003.7303 1019.4015 1037.3479 1073.8857 1085.3992 1098.6117 1105.9974 1120.5983 1156.2874 1170.0809 1176.3177 1198.9963 1248.6357 1277.7926 1280.1583 1308.8403 1332.8052 1342.9134 1353.4771 1359.7514 1386.1475 1391.2571 1447.0202 1455.3995 1457.6140 1459.5934 1464.3606 1467.0647 1470.8386 1484.3778 1625.6695 1654.9190 2972.5765 2979.7050 2988.1600 2992.0573 3006.2933 3023.6620 3029.6129 3030.0435 3055.8763 3058.7664 3075.9380 3086.4375 3092.0713 3118.2169 3120.5151
redmass: 3.8502 3.2338 2.7703 3.5049 1.1400 2.6293 2.6788 1.5303 2.2607 2.9023 2.0249 3.0436 2.9658 3.3286 3.3363 4.1715 4.3545 3.0052 3.5872 4.0354 2.6985 1.7322 2.3729 2.1874 2.6685 2.0112 2.2638 2.4087 1.8431 2.5239 1.6271 1.9119 3.4272 2.3972 2.6691 2.0224 1.6588 1.5029 1.2596 2.4169 1.3144 1.2616 1.1680 1.6087 1.2809 1.3811 1.3060 1.4244 1.2541 1.2309 1.1001 1.0620 1.0817 1.0549 1.0444 1.0850 1.0891 1.0524 7.4284 7.6398 1.0645 1.0387 1.0633 1.0360 1.0637 1.0830 1.0953 1.0597 1.1000 1.0943 1.1022 1.0975 1.1028 1.1063 1.0995
irintensity: 0.7693 1.2788 0.2095 0.4162 1.0219 2.5621 2.7861 4.4282 2.6176 8.4540 1.5851 6.1071 12.7039 1.2151 3.2570 1.4425 1.2590 5.7249 7.2601 4.4340 6.0465 8.7332 0.8325 9.2406 12.4922 1.7883 19.4840 21.1540 6.4114 65.0033 8.6024 9.1299 294.3014 30.3756 12.7944 66.2412 13.5574 1.8173 18.0372 26.1096 53.6553 19.7408 7.4496 42.5863 13.5128 4.5394 2.1508 2.2212 29.7902 25.9946 0.6700 23.0510 16.6478 8.9910 14.0665 10.4749 19.2449 17.2921 100.6294 99.7690 38.5831 17.0699 31.2159 16.2275 40.4182 20.8335 27.4238 30.0449 24.4513 17.2453 26.7832 39.7892 2.0725 31.3210 12.9223
temp: 298.150 k
press: 1.00000 atm
elementType: 8 8 7 6 6 6 6 6 6 6 6 6 1 1 1 1 1 1 1 1 1 1 1 1 1 1 1
symmnumber: 1
zpe: 599728.3 jmol-1
zpe.correction: 0.228424 hartree
zpe.thermalcorrener: 0.241402 hartree
zpe.thermalcorrenthalpy: 0.242346 hartree
zpe.thermalcorrgfe: 0.188129 hartree
zpe.sumelectzpe: -556.202187 hartree
zpe.sumelectthermal: -556.189210 hartree
zpe.sumelectthermalent: -556.188265 hartree
zpe.sumelectthermalfe: -556.242482 hartree
dipole: 1.5091 -0.3560 1.6625
dipole: 2.2733
quadrupole: -62.5830 -76.9874 -73.2533
quadrupole: 5.2151 -2.4024 -0.5032
quadrupole: 8.3582 -6.0462 -2.3121 5.2151 -2.4024 -0.5032
hfenergy: -556.4306112 hartree
pointgroup: C01 [X(C9H15N1O2)]
dipole: 0.629586 0.2869488 -0.5667711 debye
polarizability: 135.9435498|-5.7820315|98.6958835|-9.480503|7.3960255|93.1942967 unknown
InChI: InChI=1S/C9H15NO2/c1-3-12-9(11)8-5-4-6-10-7(8)2/h8H,3-6H2,1-2H3
charge 0 multiplicity 1
27 atoms
O  2.052808 0.270143 -0.846202
O  1.103246 1.198971 1.071669
N  -2.104141 -0.908411 0.031002
C  -0.325589 0.651355 -0.890962
C  -1.295438 1.81637 -0.56433
C  -2.034448 1.554587 0.765498
C  -1.005254 -0.7302 -0.644901
C  -2.811112 0.224056 0.681573
C  0.974148 0.751169 -0.092096
C  -0.344652 -1.928789 -1.296744
C  3.38917 0.258317 -0.169905
C  3.579729 -1.028207 0.637995
H  -0.034301 0.670173 -1.95763
H  -2.030727 1.893872 -1.389628
H  -0.742739 2.771893 -0.522976
H  -1.290783 1.51558 1.580879
H  -2.736303 2.379745 0.988536
H  -3.106007 -0.124592 1.689193
H  -3.757824 0.358232 0.118043
H  -0.351568 -1.825479 -2.399462
H  -0.884566 -2.846341 -1.017378
H  0.716175 -2.011435 -0.997583
H  4.101565 0.332398 -1.007035
H  3.462148 1.151529 0.475072
H  4.600612 -1.053142 1.062432
H  2.860573 -1.078756 1.472738
H  3.452277 -1.919436 -0.000899
