program: Gaussian 09
title: 000297286
version: EM64L-G09RevD.01
frameworkgroup: C1[X(C9H14O4)]
method: RPBEPBE
basis: SDD
operation: Freq
keyword: #pfreq=noraman
keyword: PBEPBE/SDD
title: #p freq=noraman PBEPBE/SDD
converged: NO YES NO NO
title: Mulliken charges:
elementType: O O O O C C C C C C C C C H H H H H H H H H H H H H H
charge: -0.219929 -0.218993 -0.411082 -0.244245 -0.243731 -0.093773 -0.490745 -0.005682 0.171421 -0.491825 -0.729285 -0.698581 0.188288 0.321219 0.245425 0.243825 0.214505 0.230842 0.242221 0.251042 0.220415 0.199935 0.257057 0.242959 0.213136 0.226807 0.378772
chargesum: 0.00000
title: Mulliken charges with hydrogens summed into heavy atoms:
elementType: O O O O C C C C C C C C C
charge: -0.219929 -0.218993 -0.032310 -0.244245 0.077488 0.151652 -0.032414 0.225161 0.171421 0.001438 -0.051878 -0.015680 0.188288
polarizability: 1.24676512e+02 6.39598736e+00 1.03036433e+02 -1.51975964e+00 1.60149715e-01 9.02392892e+01
1716.lowfreq: -22.4730 -11.6572 -0.0007 -0.0001 0.0001 3.5762 12.5646 35.4198 61.9460
frequency: -22.4559 35.2252 61.9200 97.7884 122.1472 135.1053 168.1512 208.3056 224.2901 248.9236 280.1553 291.3742 334.2024 425.8114 444.7424 467.7174 523.0853 539.3960 551.3647 594.1572 618.7468 665.0772 687.9722 766.4583 825.4937 853.2593 890.2376 905.2946 909.8400 931.7237 948.4168 1003.5923 1026.6721 1055.5962 1059.4216 1094.5994 1109.1082 1120.6724 1149.1948 1167.2048 1190.2549 1212.7907 1251.7258 1258.0812 1275.5903 1302.2617 1309.2644 1324.7855 1341.5178 1352.7889 1364.9171 1392.1557 1394.7575 1445.1262 1458.9120 1465.5840 1477.1249 1480.3851 1485.8111 1652.8413 1692.0555 2978.8123 2982.9297 2989.1807 2991.6190 3000.9759 3004.5715 3010.2223 3071.1722 3079.4565 3081.8572 3089.4420 3092.0799 3102.9880 3502.9901
redmass: 9.6155 4.9059 3.0522 3.5647 5.2462 3.3413 3.5946 1.1676 1.1866 2.5508 4.9142 2.8667 3.2403 2.5164 2.5779 3.8529 3.0358 3.3823 2.9466 4.3977 2.1828 3.6469 2.2168 3.6686 3.7893 3.3163 3.5604 2.2270 1.7232 1.7298 2.0413 1.8810 1.5491 2.1311 2.0329 3.0132 2.2365 2.2395 2.0893 2.1936 1.5319 1.3728 1.3054 1.4296 1.3610 1.2259 1.4425 1.4970 1.5839 1.5282 1.5645 1.2059 1.2601 1.0977 1.0580 1.0814 1.0484 1.0571 1.0470 8.1155 12.6050 1.0756 1.0411 1.0708 1.0367 1.0836 1.0778 1.0632 1.0986 1.0964 1.1026 1.0989 1.0995 1.1006 1.0638
irintensity: 1.7915 3.3208 0.5815 1.5943 0.0586 1.5731 4.0003 0.2725 0.2587 0.8873 2.1767 1.0860 3.4304 10.2683 4.2597 1.7116 31.3428 6.6026 20.6342 12.3207 45.9891 23.3365 85.8331 6.8373 10.8991 2.3120 30.6811 17.1026 13.7080 56.0942 56.0317 2.3380 8.3291 250.2181 134.3060 82.5764 46.9096 4.6802 34.4549 36.8305 12.8211 3.5258 36.8096 0.5587 4.5217 7.7211 13.6652 29.3756 20.1837 13.5106 37.1806 12.7760 30.9261 17.8226 6.3436 1.5852 8.8805 13.5148 17.5203 207.8247 275.1495 17.3149 20.4039 0.9335 16.7325 18.2451 12.8495 34.0950 27.5392 23.9610 7.0894 32.1455 20.4933 31.2003 26.9190
temp: 298.150 k
press: 1.00000 atm
elementType: 8 8 8 8 6 6 6 6 6 6 6 6 6 1 1 1 1 1 1 1 1 1 1 1 1 1 1
symmnumber: 1
zpe: 578092.2 jmol-1
zpe.correction: 0.220184 hartree
zpe.thermalcorrener: 0.233079 hartree
zpe.thermalcorrenthalpy: 0.234024 hartree
zpe.thermalcorrgfe: 0.180356 hartree
zpe.sumelectzpe: -651.252198 hartree
zpe.sumelectthermal: -651.239302 hartree
zpe.sumelectthermalent: -651.238358 hartree
zpe.sumelectthermalfe: -651.292025 hartree
dipole: 2.2069 -3.3821 3.4367
dipole: 5.3028
quadrupole: -74.2019 -82.1709 -80.1317
quadrupole: 7.8259 -7.1268 4.0809
quadrupole: 4.6329 -3.3361 -1.2969 7.8259 -7.1268 4.0809
hfenergy: -651.4723815 hartree
pointgroup: C01 [X(C9H14O4)]
dipole: -0.9128191 1.6690731 0.8564683 debye
polarizability: 124.2138199|7.2267312|102.0309256|-0.8873817|-4.1643685|91.7074886 unknown
InChI: InChI=1S/C9H14O4/c1-5(3-8(10)11)7-4-6(2)13-9(7)12/h5-7,10H,3-4H2,1-2H3
charge 0 multiplicity 1
27 atoms
O  2.621891 -0.302899 -0.602659
O  1.396422 -2.276119 -0.627224
O  -4.202689 0.334906 -0.125871
O  -2.366057 0.894713 -1.420152
C  0.255393 -0.084517 -0.198949
C  -0.810011 -0.736593 0.724975
C  0.957468 1.204849 0.29174
C  2.322793 1.169013 -0.439632
C  1.423708 -1.040754 -0.492824
C  -2.046542 0.185723 0.941084
C  -0.243822 -1.157053 2.102224
C  3.496431 1.814055 0.289539
C  -2.825595 0.509457 -0.318901
H  -0.232607 0.129142 -1.172132
H  -1.144047 -1.658137 0.207684
H  0.393403 2.119172 0.042951
H  1.122844 1.178235 1.3848
H  2.223277 1.572782 -1.466229
H  -1.711922 1.145759 1.383752
H  -2.737135 -0.279133 1.664342
H  -1.007786 -1.706937 2.681117
H  0.067283 -0.284872 2.707426
H  0.62559 -1.82521 1.978333
H  4.432026 1.684461 -0.280339
H  3.3135 2.897065 0.416304
H  3.630673 1.360047 1.286863
H  -4.684989 0.567141 -0.966723
