program: Gaussian 09
title: 000297280
version: EM64L-G09RevD.01
frameworkgroup: C1[X(C13H10N2O2)]
method: RPBEPBE
basis: SDD
operation: Freq
keyword: #p
keyword: freq=noraman
keyword: PBEPBE/SDD
title: #p freq=noraman PBEPBE/SDD
converged: YES YES NO NO
title: Mulliken charges:
elementType: O O N N C C C C C C C C C C C C C H H H H H H H H H H
charge: -0.195379 -0.216595 0.024294 0.009320 0.403695 0.482091 -0.305488 0.187083 -0.289655 -0.301811 -0.376996 -0.392724 -0.417569 -0.353230 -0.235041 -0.236093 -0.232413 0.284793 0.214342 0.232479 0.241520 0.229739 0.288798 0.250912 0.234560 0.233339 0.236029
chargesum: 0.00000
title: Mulliken charges with hydrogens summed into heavy atoms:
elementType: O O N N C C C C C C C C C C C C C
charge: -0.195379 -0.216595 0.024294 0.009320 0.403695 0.482091 -0.020695 0.187083 -0.075312 -0.069331 -0.135476 -0.162985 -0.128771 -0.102318 -0.000481 -0.002755 0.003617
polarizability: 3.55600082e+02 6.00231340e+00 1.79567133e+02 -2.60574839e+00 -4.69846400e+00 6.76655361e+01
1716.lowfreq: -10.5319 -2.4136 -0.0007 -0.0006 -0.0004 2.2547 16.7758 41.3205 61.5626
frequency: 15.5073 41.3167 61.5602 65.0253 98.4498 129.3034 198.9986 207.6592 225.8620 283.8777 302.1108 368.4437 376.5651 401.4829 463.9341 475.3062 534.6216 546.4545 563.1753 614.6387 638.4283 679.5161 680.5341 692.2717 747.8933 775.3721 778.4685 831.4414 841.3240 847.3765 869.4992 896.0208 931.8940 935.7631 972.5680 981.8558 987.5640 990.9773 1004.6821 1018.7497 1026.0235 1086.9074 1101.5682 1155.2210 1175.6935 1192.6242 1195.8090 1215.4898 1247.6965 1281.5726 1301.2372 1306.4291 1330.0899 1344.3560 1362.1734 1390.5024 1405.9893 1441.0201 1454.9275 1486.4687 1514.0105 1570.0036 1579.7662 1608.3420 1628.6400 3092.6387 3120.8780 3133.1946 3143.8609 3144.1654 3155.4069 3165.7319 3169.9422 3173.8036 3180.2082
redmass: 3.9526 10.1339 5.9691 6.3229 3.5765 3.9154 6.0651 6.9486 2.7607 4.7928 7.3402 7.1126 4.1494 2.7577 5.0556 3.1341 6.3697 5.1809 4.9217 6.4414 6.3163 8.2642 8.6166 1.7429 2.5696 7.1203 2.3728 2.8716 1.7974 1.3245 3.4874 1.8520 1.5461 1.4866 1.4531 1.3924 5.8883 1.2079 1.2977 4.3001 2.2256 1.6425 2.6860 2.9049 1.0648 1.7925 2.2873 1.9502 1.3514 3.6594 1.5874 1.8255 2.7562 1.5268 2.7412 5.9233 2.5908 2.3023 2.1605 2.3207 6.6586 6.0949 5.4532 5.7808 5.1103 1.0895 1.0880 1.0863 1.0887 1.0912 1.0963 1.0919 1.1015 1.0964 1.0886
irintensity: 0.6062 0.6990 0.9448 0.1418 1.4224 0.2798 0.3740 1.0292 2.3766 2.9979 1.3744 1.6867 2.2909 0.0072 3.2291 2.4941 14.6582 15.4923 18.3693 0.0222 0.2419 4.5488 2.7765 53.6791 5.5902 12.7432 50.3658 20.0565 22.5445 3.9908 7.9037 2.1871 0.5738 9.3887 2.3949 0.2392 3.2023 46.3437 14.5186 18.9119 1.8598 8.9470 0.8288 21.4642 0.4871 187.2187 153.2870 2.6821 67.6253 6.2455 7.2780 11.5731 14.1761 5.2020 80.2380 4.9719 27.1448 12.1427 54.7530 8.9769 44.6951 298.3219 20.0946 23.6205 200.5010 14.0986 7.5168 1.1315 10.2653 8.1348 30.9091 2.5516 29.7704 13.7367 22.0751
temp: 298.150 k
press: 1.00000 atm
elementType: 8 8 7 7 6 6 6 6 6 6 6 6 6 6 6 6 6 1 1 1 1 1 1 1 1 1 1
symmnumber: 1
zpe: 526111.0 jmol-1
zpe.correction: 0.200385 hartree
zpe.thermalcorrener: 0.214409 hartree
zpe.thermalcorrenthalpy: 0.215353 hartree
zpe.thermalcorrgfe: 0.156841 hartree
zpe.sumelectzpe: -760.050161 hartree
zpe.sumelectthermal: -760.036138 hartree
zpe.sumelectthermalent: -760.035193 hartree
zpe.sumelectthermalfe: -760.093706 hartree
dipole: 5.1600 -3.6266 -0.2900
dipole: 6.3137
quadrupole: -98.2424 -96.7901 -103.1571
quadrupole: 4.1858 2.9369 -2.4438
quadrupole: 1.1542 2.6064 -3.7606 4.1858 2.9369 -2.4438
hfenergy: -760.2505463 hartree
pointgroup: C01[X(C13H10N2O2)]
dipole: -1.9118659 1.5318352 0.4104456 debye
polarizability: 355.475702|-7.6525394|165.6627294|-2.0505942|37.4003741|81.69432 unknown
InChI: InChI=1S/C13H10N2O2/c16-15(17)13-10-14-9-8-12(13)7-6-11-4-2-1-3-5-11/h1-10H
charge 0 multiplicity 1
27 atoms
O  3.353128 -2.754458 -0.334521
O  1.364281 -2.283531 -1.33711
N  2.416805 -1.928889 -0.670069
N  4.2959 1.175324 0.212139
C  1.50349 0.403249 -0.10087
C  -2.384721 0.464185 0.123734
C  0.088409 0.038443 -0.233219
C  2.595183 -0.508231 -0.295674
C  -0.958401 0.790486 0.243473
C  1.910032 1.726579 0.263317
C  -2.86846 -0.700568 -0.545279
C  -3.336932 1.353886 0.703253
C  3.942015 -0.087586 -0.131708
C  3.264292 2.060915 0.409972
C  -4.249509 -0.957361 -0.627965
C  -4.720085 1.095714 0.620048
C  -5.182657 -0.062389 -0.046751
H  -0.111521 -0.906435 -0.741789
H  -0.748379 1.723448 0.786807
H  1.156952 2.504724 0.413344
H  -2.164943 -1.405546 -1.000599
H  -2.981338 2.253038 1.222114
H  4.74986 -0.807823 -0.291281
H  3.560738 3.076831 0.692099
H  -4.604864 -1.855634 -1.144391
H  -5.434865 1.791671 1.072095
H  -6.256512 -0.268038 -0.113867
