program: Gaussian 09
title: 000297273
version: EM64L-G09RevD.01
frameworkgroup: C1[X(C15H18N2O3)]
method: RPBEPBE
basis: SDD
operation: Freq
keyword: #p
keyword: freq=noraman
keyword: PBEPBE/SDD
title: #p freq=noraman PBEPBE/SDD
converged: YES YES NO NO
title: Mulliken charges:
elementType: O O O N N C C C C C C C C C C C C C C C H H H H H H H H H H H H H H H H H H
charge: -0.276941 -0.264980 -0.265744 -0.127650 -0.408568 -0.346279 -0.378383 0.139543 0.226650 0.139995 0.250914 -0.407518 -0.346677 -0.658515 -0.644510 -0.350513 -0.366751 0.199748 -0.244203 -0.204931 0.260568 0.200961 0.236302 0.226071 0.251656 0.244593 0.291322 0.307027 0.202274 0.256452 0.216057 0.221563 0.222487 0.219891 0.230347 0.268130 0.255079 0.224534
chargesum: 0.00000
title: Mulliken charges with hydrogens summed into heavy atoms:
elementType: O O O N N C C C C C C C C C C C C C C C
charge: -0.276941 -0.264980 -0.265744 -0.127650 -0.101541 0.115251 0.083990 0.139543 0.226650 0.139995 0.250914 0.088731 -0.055355 0.016268 0.019431 -0.120166 -0.098621 0.199748 0.010876 0.019603
polarizability: 2.65341800e+02 -1.37625584e+01 1.85375798e+02 -2.01833893e+01 -2.07198746e+01 1.29069912e+02
1716.lowfreq: -4.9469 -0.0005 -0.0002 0.0005 3.1097 7.0240 15.4011 25.1561 29.4708
frequency: 15.2080 24.9838 29.4454 57.9953 63.8637 72.6990 89.8583 129.4273 136.1345 152.4869 182.3803 210.2241 219.1430 231.1812 251.1124 283.5406 295.5189 319.4709 351.8143 381.0774 403.1216 434.3103 467.0079 471.9185 511.0599 516.6456 559.0148 576.5997 588.3414 595.4847 606.6606 625.5453 710.4329 726.6076 743.4785 753.5144 774.4757 776.6918 785.9500 812.9987 816.5562 881.1795 888.8665 890.3115 904.0152 916.6939 940.0858 975.0010 995.3352 1009.6122 1032.9927 1053.1268 1061.6684 1071.3347 1080.6012 1094.6554 1098.0439 1135.3132 1143.9843 1183.6878 1214.3008 1215.1365 1243.7168 1246.1895 1261.8243 1278.6649 1298.7809 1325.2715 1343.9875 1347.6564 1357.7246 1371.9905 1384.4394 1390.0169 1410.4280 1413.6032 1428.7559 1455.8452 1456.8216 1467.1294 1469.6271 1477.9179 1482.7345 1489.1743 1494.2406 1502.6642 1586.5771 1603.3178 1612.8250 1633.8551 2983.4549 2985.0971 2995.2742 2999.4337 3004.4294 3056.2374 3066.6688 3083.5457 3083.9350 3087.5309 3091.8597 3101.8075 3130.4863 3154.2257 3185.2228 3223.1980 3258.6467 3614.1410
redmass: 4.3723 4.1608 5.4658 3.9284 4.4018 2.8385 6.7757 3.8881 4.9711 3.2801 1.9889 1.1073 4.1796 1.6622 3.4382 3.8949 3.6279 2.7469 3.9485 6.8145 2.7690 3.6022 4.3268 4.5923 3.9376 1.2908 3.3721 3.7350 4.6677 4.8598 2.6314 5.8246 7.3920 6.0398 1.6596 3.1998 1.2879 1.1500 1.3676 2.8549 5.4731 3.7707 1.3396 3.9829 3.6062 1.3943 2.1367 1.3470 2.4561 3.0838 2.5975 2.1431 1.9429 2.0791 1.8442 2.1218 1.7779 1.6316 2.0640 1.5068 1.8270 2.7204 1.3679 1.7861 1.4936 1.9659 1.3398 1.3401 1.3341 2.1970 1.2922 5.0286 1.2153 1.2086 1.8695 2.2398 1.2824 7.9768 1.1067 1.0443 1.0436 1.0604 1.0566 2.8641 1.1168 3.9733 7.0781 7.9087 8.1338 8.4651 1.0359 1.0355 1.0607 1.0638 1.0633 1.0989 1.0992 1.0994 1.0989 1.1004 1.1011 1.1018 1.0878 1.0945 1.0948 1.0939 1.1038 1.0810
irintensity: 0.7399 2.1788 4.2990 1.8554 0.9800 0.1137 1.4312 0.2478 0.1932 4.0794 0.7556 0.5181 10.4179 0.1612 0.8043 2.0528 14.5235 2.6007 20.8795 0.1947 2.1198 14.7023 7.8869 6.8789 9.6866 84.3281 3.6141 0.5797 1.2807 6.3204 13.2410 5.6299 15.5982 3.3473 1.8553 22.1553 140.2005 4.7507 10.5882 0.5183 17.3716 2.6146 8.6216 33.2366 50.2423 0.2828 12.9648 2.0127 3.6377 24.2009 24.6381 265.7889 24.4452 15.0491 12.1558 63.1814 13.3840 225.9790 8.1925 100.2562 2.0093 27.0109 52.3017 168.7468 20.7623 70.4218 9.6421 21.9112 3.4151 23.8387 10.4191 69.6578 15.0590 25.3004 43.5723 48.9774 102.4511 5.2768 16.3416 5.3608 15.6935 6.8330 10.0679 11.1256 8.1609 16.7755 43.4651 313.7504 74.4766 56.2835 26.5604 24.8753 50.6269 37.6461 37.8644 6.3129 10.1993 20.6334 62.8374 10.6500 42.6833 31.5857 4.9535 24.3537 5.5177 0.8707 3.6090 68.3222
temp: 298.150 k
press: 1.00000 atm
elementType: 8 8 8 7 7 6 6 6 6 6 6 6 6 6 6 6 6 6 6 6 1 1 1 1 1 1 1 1 1 1 1 1 1 1 1 1 1 1
symmnumber: 1
zpe: 804374.4 jmol-1
zpe.correction: 0.306370 hartree
zpe.thermalcorrener: 0.325877 hartree
zpe.thermalcorrenthalpy: 0.326822 hartree
zpe.thermalcorrgfe: 0.255775 hartree
zpe.sumelectzpe: -916.115804 hartree
zpe.sumelectthermal: -916.096297 hartree
zpe.sumelectthermalent: -916.095353 hartree
zpe.sumelectthermalfe: -916.166399 hartree
dipole: 0.4898 -0.8992 -1.2894
dipole: 1.6465
quadrupole: -58.1817 -113.4428 -121.4983
quadrupole: -5.3477 -9.7342 -1.0260
quadrupole: 39.5259 -15.7352 -23.7907 -5.3477 -9.7342 -1.0260
hfenergy: -916.4221742 hartree
pointgroup: C01 [X(C15H18N2O3)]
dipole: 0.1393647 -0.4833862 0.4081034 debye
polarizability: 259.9482894|-30.7724443|138.3714866|20.0875088|23.7745413|181.4677333 unknown
InChI: InChI=1S/C15H18N2O3/c1-3-17(4-2)14(18)10-20-15(19)12-6-5-7-13-11(12)8-9-16-13/h5-9,16H,3-4,10H2,1-2H3
charge 0 multiplicity 1
38 atoms
O  0.505357 -0.509529 1.164171
O  2.14284 1.127535 -0.28866
O  -0.21394 -1.257876 -0.927036
N  4.025522 -0.218584 -0.021005
N  -4.98626 0.408538 -1.070758
C  4.86798 0.783174 -0.720788
C  4.683628 -1.456255 0.452949
C  -2.838055 -0.023428 -0.414176
C  -4.060522 0.650238 -0.048391
C  -1.719196 0.066292 0.471996
C  2.673389 0.058107 0.13471
C  1.83286 -1.031452 0.846216
C  -3.069463 -0.66885 -1.686074
C  4.952293 0.523625 -2.239651
C  5.348064 -1.30236 1.840462
C  -4.195619 1.392069 1.142764
C  -1.855168 0.816469 1.665416
C  -0.450391 -0.614382 0.126227
C  -4.384378 -0.386361 -2.055842
C  -3.072484 1.466622 1.995395
H  4.42142 1.775298 -0.53916
H  5.875327 0.765829 -0.262976
H  3.952616 -2.283024 0.472578
H  5.447324 -1.740625 -0.295993
H  1.734989 -1.915834 0.186881
H  2.268923 -1.322632 1.815346
H  -2.343556 -1.253707 -2.24349
H  -5.940838 0.759311 -1.094564
H  5.370244 -0.476283 -2.459957
H  3.947964 0.5905 -2.69086
H  5.600707 1.278073 -2.72204
H  6.098354 -0.491744 1.831722
H  4.59994 -1.061054 2.616541
H  5.859008 -2.238868 2.130732
H  -5.132444 1.897966 1.402856
H  -0.993844 0.895279 2.333073
H  -4.934861 -0.687637 -2.945597
H  -3.139727 2.039961 2.925983
