program: Gaussian 09
title: 000297254
version: EM64L-G09RevD.01
frameworkgroup: C1[X(C9H9BrN6)]
method: RPBEPBE
basis: SDD
operation: Freq
keyword: #p
keyword: freq=noraman
keyword: PBEPBE/SDD
title: #p freq=noraman PBEPBE/SDD
converged: YES YES NO NO
title: Mulliken charges:
elementType: Br N N N N N N C C C C C C C C C H H H H H H H H H
charge: -0.045325 -0.135584 -0.366199 -0.006082 -0.024492 -0.071436 -0.079029 0.476084 0.156749 -0.359458 -0.314062 -0.288027 -0.602555 -0.218398 -0.233719 -0.229137 0.268302 0.242238 0.260850 0.256625 0.271608 0.340454 0.232741 0.233786 0.234066
chargesum: 0.00000
title: Mulliken charges with hydrogens summed into heavy atoms:
elementType: Br N N N N N N C C C C C C C C C
charge: -0.045325 -0.135584 -0.025745 -0.006082 -0.024492 -0.071436 -0.079029 0.476084 0.156749 -0.091156 -0.071824 -0.288027 0.186528 0.014343 0.000067 0.004929
polarizability: 2.48500758e+02 7.10668247e+00 1.48452942e+02 -6.91501962e+00 4.50225129e+00 9.54560608e+01
1716.lowfreq: -18.3424 -12.6582 -0.0004 -0.0001 0.0006 4.2425 8.1939 25.1639 30.3173
frequency: -16.6722 25.1075 29.8396 52.5177 66.2733 114.7880 118.0396 159.7770 201.9412 238.6709 256.9974 290.4867 298.1056 399.3009 403.1278 449.0218 469.6378 515.9884 548.3237 570.6251 615.7864 640.0397 649.3911 673.9674 690.4447 692.3641 774.9657 819.8009 852.8225 871.0109 899.7962 939.0622 949.7590 986.7070 987.7957 999.2402 1002.0897 1021.3043 1043.0450 1063.2119 1091.9241 1129.4953 1175.3273 1179.6033 1192.6708 1214.1168 1250.4870 1317.6429 1367.0579 1381.7119 1425.6502 1434.4297 1455.2292 1464.3345 1465.4422 1478.4018 1492.9761 1580.9103 1603.7451 1641.2857 3014.1635 3112.7341 3132.2329 3134.3467 3143.6626 3157.9830 3169.7059 3177.6747 3533.2072
redmass: 2.5811 4.0430 3.8950 1.5315 11.6207 5.4934 6.5465 10.0301 4.8968 5.0905 5.5173 5.1037 5.2990 3.0089 3.1633 4.4321 4.9998 3.1654 4.0801 4.7832 6.4533 6.7578 7.6837 9.7916 4.0687 2.2613 1.7177 5.5923 1.2549 6.3771 7.9321 1.4221 4.5594 1.5454 4.1722 9.4916 1.3284 3.6013 3.0065 4.5526 1.6147 1.3401 1.0520 9.7229 1.1216 2.6311 4.6297 1.3297 6.6944 7.3779 1.5873 2.3159 1.5299 1.1622 1.3252 1.8034 1.5326 5.8716 6.1117 7.1867 1.0334 1.1018 1.0854 1.1026 1.0893 1.0936 1.0959 1.0989 1.0761
irintensity: 1.3136 1.6291 1.4305 2.1097 1.5032 4.6390 0.9925 3.5780 3.1653 2.2456 15.3439 5.2043 9.4752 6.8356 5.4678 4.5402 12.5285 49.0692 47.7266 41.1653 0.7597 1.4080 40.3174 2.2420 14.2272 41.7978 60.5057 50.0151 0.5524 103.8912 1.9891 4.9464 27.9152 0.4590 0.3674 14.4248 0.2510 26.4216 25.8925 6.8977 0.7202 2.3576 0.0108 13.6794 11.6452 15.1157 128.3382 4.7642 28.6300 0.4605 39.7186 19.1231 37.8044 31.3763 3.4664 21.1823 53.2568 1.5083 0.7769 57.5119 22.2898 7.7811 0.1809 1.9476 10.7622 19.6958 15.2037 13.3367 60.4195
temp: 298.150 k
press: 1.00000 atm
elementType: 35 7 7 7 7 7 7 6 6 6 6 6 6 6 6 6 1 1 1 1 1 1 1 1 1
symmnumber: 1
zpe: 468334.0 jmol-1
zpe.correction: 0.178379 hartree
zpe.thermalcorrener: 0.192406 hartree
zpe.thermalcorrenthalpy: 0.193350 hartree
zpe.thermalcorrgfe: 0.134484 hartree
zpe.sumelectzpe: -689.079535 hartree
zpe.sumelectthermal: -689.065507 hartree
zpe.sumelectthermalent: -689.064563 hartree
zpe.sumelectthermalfe: -689.123429 hartree
dipole: 1.9612 1.1366 5.6781
dipole: 6.1138
quadrupole: -92.3129 -92.9414 -109.9426
quadrupole: -2.1914 -21.4691 4.0898
quadrupole: 6.0861 5.4576 -11.5437 -2.1914 -21.4691 4.0898
hfenergy: -689.2579136 hartree
pointgroup: C01 [X(C9H9Br1N6)]
dipole: -0.627751 -1.0174849 -2.0872073 debye
dipolederiv: -0.3002073 0.2076272 -0.2090137 0.1813843 -0.3824177 0.3562604 -0.1501108 0.3638878 -0.472794 -0.2119843 -0.0309643 -0.0849469 0.0889046 -0.3323478 -0.1876586 0.0567109 -0.3160331 -0.2619067 -1.2616832 -0.002007 0.1519768 0.5197242 -0.1976115 -0.3056089 -0.2141841 -0.1992793 -0.0878527 0.8312553 0.1549628 -0.2697785 -0.1616945 -0.3804657 0.3847566 -0.093157 0.4093377 -0.7010732 -0.2886726 0.1351822 0.0863256 0.1122171 -0.0838719 0.1291189 -0.0715591 0.1643343 0.1509782 -0.3681157 0.0306111 -0.0629577 0.0023995 -0.2387672 -0.098196 -0.3033102 -0.0097296 -0.3262141 -0.0396009 -0.0548381 0.1761264 -0.0252465 -0.1265933 -0.0317857 0.0526754 -0.0093578 -0.0077905 -0.0302669 0.0309274 -0.0034435 0.0877514 -0.0764469 0.1078466 -0.2072569 0.158841 -0.1334572 0.7249827 -0.1370031 0.0989314 -0.3407761 0.4197536 0.1346757 0.6591188 0.1252061 0.2458795 -0.048623 0.0847759 -0.0834659 -0.0844578 -0.0161083 -0.077112 0.0488271 -0.0808659 -0.0592164 -0.0267465 -0.0934155 0.0618668 0.0386026 -0.052653 -0.0534379 -0.0317174 -0.0652069 -0.0750566 0.6493831 -0.3358264 0.2554607 -0.3865925 0.572337 -0.6906555 0.5368203 -0.785757 0.9037193 0.1963841 -0.0105616 -0.0754417 -0.142373 0.3118205 0.0957806 -0.1784011 0.1124515 0.1951782 -0.1280531 -0.0752936 0.0586316 -0.0928279 0.0131906 -0.1185022 0.0716574 -0.1305196 -0.0497941 -0.0240038 0.1128145 -0.109023 0.1824039 -0.0652279 -0.081606 -0.139606 -0.0892702 -0.0619368 0.0523878 -0.0240481 -0.0070237 -0.0253689 -0.060549 -0.0709453 -0.0019059 -0.0643032 -0.0907197 0.0584295 -0.076631 0.0698755 -0.0513198 0.0861972 0.0479779 0.0391861 0.0663939 0.0992253 0.124501 0.0494166 -0.0297609 0.0378025 0.0494416 0.0779116 -0.026731 0.0885565 0.0792735 0.050702 -0.0428107 -0.0867683 -0.0347082 0.0819082 -0.0089883 -0.0555977 -0.0492489 0.0449605 -0.0402217 0.0188283 0.1105019 -0.0296527 0.0461501 -0.0038684 0.1088012 -0.0414327 0.0436768 0.1192959 0.0143771 0.0182132 0.0289365 0.0007893 0.0169039 -0.0168878 0.0925502 0.0171075 0.0677595 -0.0000526 -0.0757462 0.0611366 0.2611026 0.1299705 -0.1074541 0.0121257 0.2754583 0.0366482 0.0574096 -0.0392035 0.0749028 0.0005733 0.1218936 -0.050024 0.1184726 0.0644951 -0.0177281 -0.0563108 0.0588158 -0.0844622 0.0547578 0.0925495 0.0828165 0.0938978 0.0752648 -0.1258221 0.04283 -0.0101521 0.0433141 0.1150384 0.0327189 -0.0087106 0.0349491 0.1325949 unknown
polarizability: 244.4738813|-18.395703|125.0822931|11.488716|-29.0955349|122.8535868 unknown
InChI: InChI=1S/C9H9BrN6/c1-16-9(13-14-15-16)12-11-8(10)7-5-3-2-4-6-7/h2-6,12H,1H3
charge 0 multiplicity 1
25 atoms
Br 0.105175 -1.481916 1.485803
N  3.392281 -0.716485 0.426261
N  1.560527 0.197506 -0.936616
N  0.173514 0.292379 -0.859617
N  4.097187 -0.353829 1.577373
N  2.493221 1.197386 1.143498
N  3.529234 0.805494 2.006233
C  -2.066705 -0.02973 -0.001984
C  2.422134 0.234262 0.183232
C  -2.575082 1.027267 -0.815042
C  -2.979769 -0.823944 0.740406
C  -0.602358 -0.260512 0.017015
C  3.688159 -1.957185 -0.29063
C  -3.960009 1.26708 -0.887502
C  -4.366873 -0.575463 0.66529
C  -4.864678 0.467489 -0.147786
H  -1.869301 1.646649 -1.375333
H  -2.606013 -1.631313 1.376945
H  2.842581 -2.179256 -0.960021
H  4.614628 -1.854702 -0.879745
H  3.810247 -2.77313 0.437419
H  1.892383 0.681834 -1.773085
H  -4.33504 2.084246 -1.513321
H  -5.057579 -1.196994 1.245021
H  -5.941663 0.661068 -0.19931
