program: Gaussian 09
title: 000297239
version: EM64L-G09RevD.01
frameworkgroup: C1[X(C12H14N6O3)]
method: RPBEPBE
basis: SDD
operation: Freq
keyword: #p
keyword: freq=noraman
keyword: PBEPBE/SDD
title: #p freq=noraman PBEPBE/SDD
converged: YES YES NO NO
title: Mulliken charges:
elementType: O O O N N N N N N C C C C C C C C C C C C H H H H H H H H H H H H H H
charge: -0.291045 -0.251647 -0.288521 -0.379494 0.003766 -0.179880 -0.608657 -0.352698 0.000715 -0.118148 -0.506557 0.083552 0.190807 0.317038 -0.479955 0.472197 -0.365768 -0.392467 -0.227661 -0.225228 -0.232555 0.306001 0.256912 0.220971 0.326240 0.221637 0.247228 0.274733 0.231688 0.328886 0.360274 0.369738 0.230684 0.227094 0.230123
chargesum: 0.00000
title: Mulliken charges with hydrogens summed into heavy atoms:
elementType: O O O N N N N N N C C C C C C C C C C C C
charge: -0.291045 -0.251647 -0.288521 -0.053254 0.003766 -0.179880 0.080502 0.017040 0.000715 0.187853 -0.028674 0.083552 0.190807 0.317038 -0.011090 0.472197 -0.091035 -0.160779 0.003023 0.001866 -0.002432
polarizability: 2.22330321e+02 -2.11504486e+01 1.68826263e+02 6.34660104e+00 9.53610019e+00 1.35635584e+02
1716.lowfreq: -1.7010 -0.0004 0.0003 0.0005 2.2732 9.1803 13.5423 17.4181 23.5744
frequency: 12.6818 17.2334 22.9854 37.0653 46.8293 57.1877 69.8512 85.7809 110.1152 146.2641 152.4045 198.5161 204.1197 238.0491 266.2708 320.1722 338.1405 384.6959 404.2610 406.4158 443.6135 469.0760 521.2743 540.5441 572.1212 589.4533 611.2436 618.2507 636.5192 647.6232 665.9750 687.7667 696.8312 706.4205 713.5483 735.9772 760.1757 772.6576 815.9687 856.4342 859.5860 874.4548 929.0417 934.6744 946.2830 956.8419 963.8821 981.8090 986.5342 991.2572 1002.2838 1011.8060 1027.6240 1056.3257 1085.9961 1091.3714 1101.0672 1109.8209 1139.7282 1160.3757 1173.6683 1187.4385 1191.7119 1221.8741 1238.0923 1239.4275 1282.3317 1318.5780 1329.6140 1333.4962 1350.7974 1356.3224 1386.0070 1402.7488 1442.5576 1443.1242 1460.5894 1461.6260 1478.6435 1485.2881 1594.5660 1601.1811 1615.1409 1644.9309 1657.4928 3020.3035 3036.4639 3043.2973 3104.5301 3110.7892 3119.4132 3128.9671 3140.6266 3151.5055 3165.5475 3458.8219 3559.0153 3600.4738 3635.0840
redmass: 6.8735 7.2818 4.8606 5.3315 6.0730 8.3154 7.9806 6.1151 6.7015 4.5125 6.0721 5.3884 6.5831 6.2390 7.8807 5.1671 3.6348 2.8470 2.8224 3.0363 2.6961 3.9918 4.5538 2.7043 1.2677 3.2619 1.5479 5.9266 4.7982 7.1748 1.2690 4.5538 6.3006 1.9211 3.4857 1.2031 2.1568 5.5998 3.5158 4.0296 1.2773 4.8007 3.4191 1.6255 2.8520 11.5015 2.3734 1.6344 2.3866 5.0054 1.3338 7.1370 2.2087 4.1037 2.0802 1.5175 5.8454 5.5837 2.8315 2.2250 1.0541 1.4221 1.6325 2.8768 2.5116 1.1653 1.2985 1.4681 1.2583 1.2994 1.2914 2.7402 7.9907 1.6039 3.5108 2.2103 1.2523 1.1360 1.8132 2.2944 6.0840 1.3576 6.0821 4.1090 8.8191 1.0639 1.0586 1.0819 1.1015 1.1073 1.0870 1.0873 1.0919 1.0964 1.1016 1.0485 1.0775 1.0848 1.1017
irintensity: 2.7042 0.4396 0.8178 1.6561 1.2237 4.8893 2.7263 9.3884 4.6325 8.4707 0.3222 7.1212 2.7313 6.6154 10.2215 1.2096 0.3818 26.6244 0.1625 4.6034 1.7138 15.3835 5.7796 16.0373 83.7089 55.0329 138.1680 4.5000 6.7804 25.4624 203.2592 3.5505 22.2025 71.0685 5.9617 112.0078 65.6376 18.9588 9.5892 23.0534 0.3877 34.8447 44.2060 8.9278 51.9199 26.8191 29.3473 24.1473 77.2010 30.8260 2.1383 4.7535 3.6593 20.4966 19.1982 7.6426 27.7586 36.3586 12.7384 72.1777 0.0894 136.7948 147.8682 26.2885 25.7414 11.1434 98.7848 43.0780 4.4441 37.4300 32.3802 126.5019 0.7091 9.0986 10.8043 10.1491 38.4251 10.0016 345.6861 31.3668 1.7076 81.5611 0.2980 157.6496 379.4110 13.8114 33.8938 10.3127 5.2628 5.3170 6.4857 2.3282 17.6487 24.8987 22.7329 71.2654 31.4687 125.9114 61.8699
temp: 298.150 k
press: 1.00000 atm
elementType: 8 8 8 7 7 7 7 7 7 6 6 6 6 6 6 6 6 6 6 6 6 1 1 1 1 1 1 1 1 1 1 1 1 1 1
symmnumber: 1
zpe: 699596.3 jmol-1
zpe.correction: 0.266462 hartree
zpe.thermalcorrener: 0.285679 hartree
zpe.thermalcorrenthalpy: 0.286624 hartree
zpe.thermalcorrgfe: 0.213659 hartree
zpe.sumelectzpe: -1018.302897 hartree
zpe.sumelectthermal: -1018.283680 hartree
zpe.sumelectthermalent: -1018.282736 hartree
zpe.sumelectthermalfe: -1018.355701 hartree
dipole: 1.3349 -4.2724 -2.5110
dipole: 5.1323
quadrupole: -95.2697 -120.6937 -126.0558
quadrupole: -12.7309 7.0877 -6.3731
quadrupole: 18.7367 -6.6873 -12.0494 -12.7309 7.0877 -6.3731
hfenergy: -1018.5693594 hartree
pointgroup: C01 [X(C12H14N6O3)]
dipole: 0.5217452 1.8878609 -0.490846 debye
polarizability: 220.8959646|9.5652746|161.9415945|-22.4581948|-16.6198642|143.954609 unknown
InChI: InChI=1S/C12H14N6O3/c13-10(19)6-9(11-15-17-18-16-11)14-12(20)21-7-8-4-2-1-3-5-8/h1-5,9,14,17H,6-7,13H2
charge 0 multiplicity 1
35 atoms
O  -1.488275 1.205168 -0.733659
O  2.670061 -3.11255 1.666746
O  -0.707724 -0.917667 -1.42615
N  0.574229 0.5243 -0.08405
N  3.090708 0.452487 -1.988922
N  4.010624 0.878145 0.067631
N  4.351457 -1.507361 1.799327
N  4.272812 1.134489 -2.062083
N  4.867278 1.410668 -0.840964
C  1.748114 -0.357578 0.014627
C  2.019762 -0.750363 1.494927
C  2.945948 0.305132 -0.635616
C  3.034103 -1.89915 1.65476
C  -0.549232 0.163281 -0.803161
C  -2.811994 0.921627 -1.393012
C  -3.794292 0.295924 -0.427319
C  -3.800156 -1.108654 -0.219697
C  -4.721478 1.103276 0.279159
C  -4.7151 -1.690826 0.684737
C  -5.639137 0.521109 1.182158
C  -5.636904 -0.878406 1.386767
H  1.489478 -1.264613 -0.562142
H  1.06669 -1.112417 1.912773
H  2.34456 0.139937 2.063515
H  0.568597 1.425157 0.39736
H  -3.138983 1.919363 -1.725103
H  -2.617154 0.267901 -2.260498
H  -3.07818 -1.73099 -0.760476
H  -4.723294 2.189156 0.121798
H  5.065409 -2.228349 1.903345
H  4.621338 -0.530938 1.649281
H  4.693211 1.413061 -2.948933
H  -4.711862 -2.7754 0.840018
H  -6.353484 1.153361 1.721266
H  -6.348427 -1.33228 2.085893
