program: Gaussian 09
title: 000297209
version: EM64L-G09RevD.01
frameworkgroup: C1[X(C8H8O4)]
method: RPBEPBE
basis: SDD
operation: Freq
keyword: #p
keyword: freq=noraman
keyword: PBEPBE/SDD
title: #p freq=noraman PBEPBE/SDD
converged: YES YES NO NO
title: Mulliken charges:
elementType: O O O O C C C C C C C C H H H H H H H H
charge: -0.418330 -0.442871 -0.212004 -0.247709 -0.265220 0.283571 -0.471586 -0.227284 -0.345567 -0.184694 0.193207 0.088111 0.278357 0.230294 0.243549 0.246750 0.266785 0.220875 0.378365 0.385401
chargesum: 0.00000
title: Mulliken charges with hydrogens summed into heavy atoms:
elementType: O O O O C C C C C C C C
charge: -0.039966 -0.057470 -0.212004 -0.247709 0.013137 0.283571 0.002257 0.019466 -0.078782 0.036181 0.193207 0.088111
polarizability: 1.03669918e+02 -1.23138702e+01 1.12459144e+02 -2.03112238e+00 -1.30283208e+01 6.47725246e+01
1716.lowfreq: -11.1322 -8.6659 -4.2463 -0.0011 -0.0009 -0.0007 45.1833 56.8633 82.0364
frequency: 45.1824 56.8360 82.0358 121.6505 158.6520 208.9164 241.5797 338.5150 360.2715 408.2867 411.6671 484.5430 554.6508 560.9198 581.7654 593.6329 631.2774 678.0482 694.2255 721.8926 743.0899 863.7779 885.0605 896.7992 955.8020 972.3113 984.4732 991.9212 998.1379 1051.0622 1097.5376 1118.2815 1177.4588 1181.0715 1223.8972 1272.8218 1299.3145 1309.2968 1347.2543 1367.2940 1383.6428 1437.3004 1639.5954 1661.7977 1671.2248 1700.5647 2942.4756 2974.9409 3004.7170 3118.7873 3126.9203 3154.1962 3517.8483 3535.5925
redmass: 10.7670 3.9106 10.6626 6.1129 4.8143 5.1053 2.4387 6.4541 7.4461 2.9075 4.2471 5.1783 3.2564 2.9625 2.1973 1.5345 2.1343 1.7261 4.3230 2.8388 4.7891 1.6420 3.3997 3.4744 3.9946 1.6553 2.0888 1.6334 3.4795 2.4330 1.5126 1.7750 1.1216 1.0649 1.3355 1.5271 2.3576 1.7985 1.6152 2.5885 1.7838 1.0875 8.8232 7.7519 8.7735 7.1338 1.0634 1.0928 1.0818 1.0856 1.0915 1.0988 1.0641 1.0642
irintensity: 0.8363 0.9956 0.9138 3.4734 1.1211 0.9965 0.5495 1.4674 4.6132 4.0705 9.5470 23.2226 25.2161 26.9455 40.6401 116.8686 52.9619 127.8604 39.0003 1.7927 10.6354 0.8211 18.5107 33.9394 38.7612 47.5857 115.6918 6.1811 35.1008 266.8314 9.7001 163.5579 0.0797 0.3876 4.7796 9.5051 66.5370 26.2841 5.5537 19.1527 4.1883 29.1091 256.8758 30.4192 200.5512 11.5044 21.7828 16.0896 2.2934 8.6687 3.0503 26.2289 25.3914 41.9910
temp: 298.150 k
press: 1.00000 atm
elementType: 8 8 8 8 6 6 6 6 6 6 6 6 1 1 1 1 1 1 1 1
symmnumber: 1
zpe: 386039.8 jmol-1
zpe.correction: 0.147035 hartree
zpe.thermalcorrener: 0.158093 hartree
zpe.thermalcorrenthalpy: 0.159037 hartree
zpe.thermalcorrgfe: 0.109266 hartree
zpe.sumelectzpe: -609.649253 hartree
zpe.sumelectthermal: -609.638194 hartree
zpe.sumelectthermalent: -609.637250 hartree
zpe.sumelectthermalfe: -609.687022 hartree
dipole: 2.4659 0.3964 -1.3783
dipole: 2.8527
quadrupole: -64.6995 -59.4485 -73.8967
quadrupole: -8.3332 4.4710 -0.8966
quadrupole: 1.3154 6.5664 -7.8818 -8.3332 4.4710 -0.8966
hfenergy: -609.7962877 hartree
pointgroup: C01 [X(C8H8O4)]
dipole: 0.86779 -0.4308572 0.566483 debye
dipolederiv: -0.3909556 0.0169075 0.0343158 0.0063004 -1.1914525 0.423182 0.022341 0.3058521 -0.426658 -0.6995098 -0.4292101 0.2631528 -0.4002837 -0.7779073 0.2077783 0.263375 0.2048808 -0.5304824 -0.3803718 0.0307796 -0.2062231 -0.0930064 -0.6628807 -0.0649616 -0.2997223 0.0795586 -0.8601851 -0.8488773 0.2897859 -0.0519637 0.2749144 -0.8033108 0.1725951 -0.057748 0.1842305 -0.3958168 -0.1472536 -0.1747905 -0.1499897 -0.1018668 -0.0736892 -0.0048086 -0.0829813 -0.0689405 0.0604967 -0.6850549 -0.1092449 0.0844937 -0.2219279 0.1118298 0.0015805 0.1544819 -0.0256759 -0.0908852 -0.183034 0.0005088 0.0273867 -0.0409932 0.0251084 0.0950468 0.1030706 0.1210548 0.1372546 0.2623331 0.0805931 0.1056494 -0.0396658 -0.1210002 -0.1432406 0.012119 -0.1200657 -0.1949758 0.4127606 0.0477 -0.0678945 0.1915107 -0.0019495 -0.0890897 -0.1637523 -0.0877862 -0.071524 0.0281126 -0.0947156 0.003456 -0.0704625 0.1037528 -0.1458988 0.0101526 -0.1842607 -0.1469719 0.3594823 0.1024395 0.325232 0.213252 1.59506 -0.1875736 0.4135271 -0.1402608 1.1270927 1.7037081 0.1057772 -0.2367755 -0.0245394 1.1521634 -0.4087166 -0.1616031 -0.407497 0.4486353 0.0593064 -0.0300028 0.0486477 -0.004236 0.0551001 0.0446944 0.0435373 0.0277797 0.0015722 -0.0019143 -0.049329 -0.0461707 -0.0440179 -0.0886525 -0.0487075 -0.0991571 -0.0879938 0.0810865 0.0230845 0.0183235 0.0533859 0.0506529 0.0831387 0.0142298 0.0680605 0.0707355 -0.0827994 0.0193775 0.0485632 -0.0217353 0.0820479 -0.0172856 0.0939704 -0.0343159 0.0883545 0.1202706 0.0617469 0.0703136 -0.0235944 0.0563099 -0.0030225 0.0462842 -0.0109615 0.0517457 0.1341492 -0.1456407 0.0370317 -0.0361391 0.0441634 0.0711179 0.037275 -0.0204028 0.0609279 0.1507377 0.3449806 -0.0539798 -0.0800026 -0.0236802 0.2828114 -0.0755454 -0.0895412 -0.1189958 0.1682784 0.2077194 0.092549 -0.0252314 0.1455283 0.2610685 0.0319059 -0.0704793 0.0463564 0.3707245 unknown
polarizability: 111.7157193|12.7220397|103.7782129|-1.6819352|-13.8408793|65.4076548 unknown
InChI: InChI=1S/C8H8O4/c9-7(10)5-3-1-2-4-6(5)8(11)12/h1,3-5,9,11H,2H2
charge 0 multiplicity 1
20 atoms
O  -0.1734 -2.917467 0.337042
O  -2.449101 0.07554 0.733742
O  -0.671076 -1.554861 -1.477257
O  -2.250746 2.166693 -0.260669
C  0.215094 -0.558833 0.638681
C  -0.247838 0.805411 0.153452
C  2.10682 1.596398 -0.331414
C  1.734432 -0.65629 0.750809
C  0.611814 1.767321 -0.285133
C  2.578091 0.306375 0.305065
C  -0.273051 -1.673255 -0.302435
C  -1.701329 1.120436 0.159418
H  -0.236814 -0.787067 1.62325
H  2.593218 2.467415 0.157647
H  2.447103 1.647744 -1.389739
H  2.120602 -1.573861 1.208959
H  0.187845 2.723639 -0.619766
H  3.661586 0.16764 0.412248
H  -0.463637 -3.633405 -0.290464
H  -3.414013 0.312325 0.698664
