program: Gaussian 09
title: 000297204
version: EM64L-G09RevD.01
frameworkgroup: C1[X(C9H12O3)]
method: RPBEPBE
basis: SDD
operation: Freq
keyword: #pfreq=noraman
keyword: PBEPBE/SDD
title: #p freq=noraman PBEPBE/SDD
converged: YES YES NO NO
title: Mulliken charges:
elementType: O O O C C C C C C C C C H H H H H H H H H H H H
charge: -0.268860 -0.269423 -0.216151 -0.295896 0.319741 -0.463133 -0.221589 -0.390414 -0.185984 0.255811 -0.538209 -0.505153 0.258842 0.213476 0.227797 0.237849 0.229641 0.212880 0.240681 0.226788 0.215654 0.232256 0.240182 0.243214
chargesum: 0.00000
title: Mulliken charges with hydrogens summed into heavy atoms:
elementType: O O O C C C C C C C C C
charge: -0.268860 -0.269423 -0.216151 -0.037054 0.319741 -0.021861 0.016259 -0.160773 0.026897 0.255811 0.144914 0.210498
polarizability: 1.23766447e+02 1.03915281e+01 1.07866775e+02 -1.28148165e+01 -2.44743381e+00 7.70092426e+01
1716.lowfreq: -0.0007 -0.0004 -0.0001 1.3733 8.5462 9.7970 35.7264 55.5698 82.1751
frequency: 35.6554 55.5278 82.1607 104.2427 127.8006 182.8084 200.6427 210.7533 229.8892 270.3789 286.2241 339.1949 394.6233 427.6242 491.1784 549.3540 565.3353 671.0230 675.5634 739.1746 744.8606 790.8556 874.5760 885.4004 912.3506 945.4490 966.6719 977.9260 991.2733 1008.1001 1091.1823 1111.8645 1113.4530 1116.3314 1148.2550 1151.3230 1174.8697 1175.8874 1181.5347 1254.2279 1291.6720 1339.1301 1357.5947 1384.1345 1421.4560 1434.1664 1452.2098 1452.4784 1464.1097 1465.1254 1476.1270 1655.0195 1672.0604 1701.9675 2935.0175 2957.7309 2965.8492 3000.1966 3003.6412 3044.4962 3105.1978 3108.7949 3124.1494 3142.4571 3145.8266 3147.6116
redmass: 4.9971 3.6752 3.4402 1.0992 3.2553 4.2298 3.3417 2.0478 2.2323 3.6723 1.6791 4.5454 3.3395 4.6045 4.3859 5.5507 4.9139 1.7179 4.8099 3.5112 4.8888 1.3231 5.5548 4.8980 3.2527 1.8146 3.7144 1.3905 4.4513 2.6732 1.6424 2.6923 1.3034 1.3327 1.4357 1.6310 1.1158 1.5533 1.5028 1.4718 1.4062 1.6972 2.3962 1.6747 1.1719 1.1814 1.0873 1.0510 1.0501 1.0502 1.0514 9.1383 7.2500 7.1583 1.0621 1.0329 1.0948 1.0802 1.0309 1.1032 1.1045 1.0848 1.0996 1.0947 1.0945 1.1047
irintensity: 2.2792 0.0750 7.2880 0.6102 3.3271 2.5275 1.6915 2.6006 4.5758 9.6153 0.5789 8.2731 1.1933 4.1747 2.2299 0.5336 5.3222 20.5182 26.3423 44.6600 7.1187 22.8349 13.5404 18.3258 14.6425 6.2402 13.2476 3.0988 45.4178 27.7100 43.8523 246.3149 13.1182 19.2440 7.8847 38.2536 7.0426 48.7178 51.1754 54.3075 19.6865 2.2407 26.0856 17.6294 15.4865 6.0997 10.6966 13.7218 13.0570 12.8100 16.8848 151.1591 14.5328 47.3300 49.2687 52.6286 28.5953 11.8244 33.3682 46.5402 26.1017 9.6409 23.6575 50.8273 2.5609 17.6856
temp: 298.150 k
press: 1.00000 atm
elementType: 8 8 8 6 6 6 6 6 6 6 6 6 1 1 1 1 1 1 1 1 1 1 1 1
symmnumber: 1
zpe: 505444.8 jmol-1
zpe.correction: 0.192514 hartree
zpe.thermalcorrener: 0.205074 hartree
zpe.thermalcorrenthalpy: 0.206019 hartree
zpe.thermalcorrgfe: 0.152897 hartree
zpe.sumelectzpe: -574.858752 hartree
zpe.sumelectthermal: -574.846191 hartree
zpe.sumelectthermalent: -574.845247 hartree
zpe.sumelectthermalfe: -574.898368 hartree
dipole: -0.6731 -0.2668 -0.4530
dipole: 0.8541
quadrupole: -54.1510 -63.3924 -76.7100
quadrupole: -2.5917 -2.6019 -0.6749
quadrupole: 10.6002 1.3587 -11.9589 -2.5917 -2.6019 -0.6749
hfenergy: -575.0512654 hartree
pointgroup: C01 [X(C9H12O3)]
dipole: -0.254768 0.1203215 0.1831412 debye
dipolederiv: -0.4717091 -0.1922939 -0.0101596 -0.0955123 -1.3384362 0.232845 -0.0536307 0.1920971 -0.3270589 -1.5304582 0.0645628 -0.1610885 -0.0011876 -0.3141004 -0.0799844 -0.1916205 -0.077933 -0.5001159 -0.6951307 0.0756336 0.0661432 -0.0560986 -0.3892311 -0.2030452 -0.1206174 -0.2897089 -0.7640612 -0.1240994 0.0292954 0.045682 0.1643139 -0.1963439 -0.0787002 0.0374031 -0.0326646 0.141002 0.3631592 -0.1094809 0.094126 -0.0131628 1.0695157 -0.3154028 0.1119786 -0.3139697 0.0815491 0.0025104 -0.0580527 -0.1030803 -0.0605882 0.0848176 -0.0061962 -0.1482474 0.0175271 0.1953321 -0.1375839 0.0247067 0.1126686 -0.1006287 0.2792708 0.040239 0.1296416 -0.0733713 -0.2231079 -0.2237779 0.2569269 0.0066254 -0.0036594 -0.1386231 -0.021859 0.0790218 0.0370358 -0.2931511 0.1402484 0.0874104 0.1382127 0.135501 0.0283145 -0.0154674 0.1799571 -0.0032127 -0.1497558 1.7743232 -0.1733433 0.1054766 0.0208758 0.3319571 0.338198 0.2964797 0.3966409 0.9513722 0.3665744 0.3441605 -0.0737232 0.1087553 0.5229526 -0.01613 -0.0067439 0.091588 0.2843939 0.610094 -0.0518769 -0.0254888 -0.078922 0.2764766 -0.0120308 -0.1604335 0.0022663 0.2351056 0.0451022 0.0039759 -0.0633167 0.0302498 0.0547952 0.0436603 -0.0636221 0.0400225 -0.0392277 -0.128429 0.0908682 0.0490937 0.0683668 -0.0395979 -0.0260767 0.1045473 -0.0545736 0.0767352 0.0693962 -0.0119469 -0.0270961 -0.0232331 0.0094563 0.0399322 -0.0901714 0.0835785 -0.1446922 -0.0144523 -0.1077884 -0.0743074 -0.076723 -0.0239186 -0.0124325 -0.0712973 -0.0151822 0.1330491 -0.0328384 -0.1199477 -0.0422738 -0.1190459 -0.0195235 0.0028256 -0.0618419 0.0045263 0.1687319 0.071025 -0.0144488 -0.0270172 -0.0112776 -0.169276 0.0228241 -0.0557077 0.039709 0.1504335 0.0791223 0.0616016 -0.0281229 0.0135694 -0.126786 0.0623845 -0.0188652 0.0740356 0.0962728 0.026798 -0.102487 -0.0229024 -0.0046381 0.0567145 0.041001 -0.0557922 -0.0786806 -0.1407623 -0.1342127 -0.0857058 0.1157917 0.0733075 0.0308949 -0.0600973 0.0813984 -0.0471014 0.0112842 -0.0821471 -0.0165242 -0.0723488 -0.0432997 0.103863 -0.0394111 -0.1120988 -0.0366698 0.023931 0.0136393 0.0324242 -0.0108419 0.0100179 0.0196909 0.0953069 0.1082712 0.0884145 -0.0524149 0.0128459 -0.0276697 0.0079476 0.0630197 -0.112883 -0.0323826 0.0819912 -0.0443739 0.0851555 unknown
polarizability: 125.3349941|-9.3546886|107.0458677|10.8920725|-4.7105815|76.2616032 unknown
InChI: InChI=1S/C9H12O3/c1-11-8-6-4-3-5-7(8)9(10)12-2/h3,5-7H,4H2,1-2H3
charge 0 multiplicity 1
24 atoms
O  -0.84684 -1.720981 0.878795
O  2.645827 0.085701 0.550405
O  1.338758 -0.580358 -1.260659
C  0.274231 0.378207 0.794825
C  -1.004868 -0.376271 0.50046
C  -2.196246 1.651556 -0.402963
C  0.115216 1.881689 0.59859
C  -2.119705 0.182157 -0.041159
C  -0.988309 2.443935 0.046682
C  1.425195 -0.115077 -0.106783
C  -1.955377 -2.629151 0.584318
C  3.85577 -0.279921 -0.225342
H  0.591157 0.17194 1.835798
H  -3.112604 2.099853 0.038255
H  -2.322072 1.769121 -1.502403
H  0.965324 2.498705 0.913879
H  -3.012994 -0.422348 -0.234492
H  -1.029968 3.534186 -0.080019
H  -1.617968 -3.621146 0.918883
H  -2.170808 -2.64761 -0.501695
H  -2.869638 -2.335575 1.137533
H  4.698908 -0.029559 0.433628
H  3.897773 0.296822 -1.164773
H  3.843137 -1.356876 -0.463166
