program: Gaussian 09
title: 000297202
version: EM64L-G09RevD.01
frameworkgroup: C1[X(C9H14O2)]
method: RPBEPBE
basis: SDD
operation: Freq
keyword: #pfreq=noraman
keyword: PBEPBE/SDD
title: #p freq=noraman PBEPBE/SDD
converged: YES YES NO NO
title: Mulliken charges:
elementType: O O C C C C C C C C C H H H H H H H H H H H H H H
charge: -0.271718 -0.237680 -0.439860 -0.236506 -0.434763 -0.435955 -0.208886 -0.185244 0.244319 -0.227179 -0.673864 0.248764 0.220196 0.206723 0.245582 0.201650 0.215325 0.210648 0.230171 0.203353 0.227961 0.226797 0.211314 0.229484 0.229366
chargesum: 0.00000
title: Mulliken charges with hydrogens summed into heavy atoms:
elementType: O O C C C C C C C C C
charge: -0.271718 -0.237680 -0.012941 0.012257 0.012470 -0.009982 0.021286 0.018109 0.244319 0.227580 -0.003699
polarizability: 1.28589324e+02 -2.68021909e-01 9.28639592e+01 -6.41301914e+00 -3.36441269e-02 7.93911570e+01
1716.lowfreq: -7.8037 -5.2526 -0.0005 -0.0003 -0.0002 13.1360 29.0127 59.5618 74.4872
frequency: 26.5480 59.5566 74.4374 100.2389 143.9992 202.7691 223.0848 254.9146 303.4949 327.3879 387.7608 421.4996 442.2229 529.3747 626.7006 650.7519 724.1733 763.7494 797.2146 808.2428 814.8880 851.4181 885.7998 920.9337 928.5859 977.7629 986.3838 1024.4880 1055.0818 1081.4855 1093.9214 1113.0575 1123.0300 1134.8697 1142.7204 1158.6862 1237.4758 1240.2415 1246.4776 1279.7615 1302.9999 1331.3922 1338.4987 1349.2665 1354.6227 1376.2390 1400.0673 1451.7571 1462.7660 1463.1463 1474.2159 1475.3393 1486.9457 1631.5645 1669.4282 2951.7832 2979.8374 2994.5954 2995.1893 2997.7495 3008.9044 3010.2740 3054.4779 3064.8349 3066.6778 3091.1757 3096.9983 3105.8689 3139.7604
redmass: 3.1266 4.1262 2.9081 2.8254 2.5790 2.7563 2.0558 1.4740 2.8964 3.1089 3.2576 2.9410 2.7966 4.7090 4.4499 1.9455 1.6415 3.4650 1.1127 3.0737 3.1114 2.6515 1.9087 2.4984 2.7021 1.2354 2.9858 2.3865 1.7698 1.7070 2.6924 2.1211 1.5639 1.4650 1.3241 1.2424 1.2557 1.2955 1.1420 1.4380 1.8227 1.3401 1.5267 1.4909 1.4100 1.4908 1.2636 1.0907 1.0883 1.0404 1.0590 1.0874 1.0696 9.8163 6.6521 1.0642 1.0756 1.0361 1.0666 1.0719 1.0584 1.0864 1.0992 1.1031 1.1065 1.0985 1.0858 1.1026 1.0974
irintensity: 0.3816 0.7181 0.5018 1.5421 3.2964 3.1314 1.5206 2.2166 5.6304 6.9266 5.4149 0.8903 1.8648 1.6821 0.3264 30.5054 14.3635 17.1448 4.1051 4.7482 3.9445 6.4763 32.0977 12.4119 0.3138 0.4647 31.4243 62.6364 28.0613 1.6175 169.7123 6.5690 129.3542 6.9886 89.9773 26.5124 3.0531 10.9983 0.2188 7.9439 34.8912 2.5128 1.7344 3.0010 0.6124 1.4932 21.4048 9.9197 14.3258 11.4235 5.4898 14.0970 12.5650 163.8702 0.9606 40.8919 11.4877 20.2902 27.5990 41.7168 18.4288 44.0558 32.3640 39.9330 8.4793 31.4830 14.6550 45.2263 32.0148
temp: 298.150 k
press: 1.00000 atm
elementType: 8 8 6 6 6 6 6 6 6 6 6 1 1 1 1 1 1 1 1 1 1 1 1 1 1
symmnumber: 1
zpe: 558007.5 jmol-1
zpe.correction: 0.212534 hartree
zpe.thermalcorrener: 0.224071 hartree
zpe.thermalcorrenthalpy: 0.225016 hartree
zpe.thermalcorrgfe: 0.173899 hartree
zpe.sumelectzpe: -500.930393 hartree
zpe.sumelectthermal: -500.918856 hartree
zpe.sumelectthermalent: -500.917912 hartree
zpe.sumelectthermalfe: -500.969029 hartree
dipole: -0.6411 1.2617 0.5351
dipole: 1.5130
quadrupole: -54.9020 -69.7917 -66.3719
quadrupole: -0.2721 0.6554 -3.4863
quadrupole: 8.7865 -6.1032 -2.6833 -0.2721 0.6554 -3.4863
hfenergy: -501.1429273 hartree
pointgroup: C01 [X(C9H14O2)]
dipole: 0.215943 -0.3154881 0.4562779 debye
dipolederiv: -1.6153595 0.3967472 -0.1228678 0.5036697 -0.455621 0.1098968 -0.1347688 0.1266081 -0.4830626 -0.710661 0.0247112 0.1221679 0.1944415 -0.4196352 0.1630405 -0.1010145 0.3720701 -0.7954384 0.0627975 -0.0417175 -0.0399727 -0.0429314 0.0675169 0.0140192 -0.0150602 0.0016987 0.0868801 -0.1989724 -0.0622505 0.0704994 -0.1202813 -0.010231 0.1532789 0.1134947 0.0776461 -0.00293 0.0730289 -0.0322911 -0.0193058 -0.0429557 0.0758578 -0.0162244 -0.0215478 -0.0136606 0.0451479 -0.0063742 -0.0017815 -0.1082613 -0.0004025 0.0127036 0.0874231 -0.0337086 0.0909521 0.1342159 -0.0815272 0.102256 0.0821366 0.2952975 0.1393865 -0.183997 0.0844445 -0.1071401 -0.1669611 0.0854262 -0.0033854 0.1664935 -0.1245642 0.0512037 -0.1062269 0.1921914 -0.0982995 -0.1173941 1.7010994 -0.2917823 -0.0397022 -0.5970554 0.4161164 -0.3190264 0.2293998 -0.5325744 0.9860011 0.8784787 -0.1197969 -0.02121 -0.1191266 0.365694 0.037083 -0.204871 0.0770399 0.2617131 -0.089302 0.0688882 -0.0547116 0.0748533 0.0193829 0.0378565 -0.0306633 0.0364567 0.0277331 0.0089693 -0.0203666 -0.0784425 -0.0490258 0.0289548 -0.0469613 -0.0837624 -0.054559 -0.0466172 0.0450315 -0.1053174 0.0101214 -0.0802543 -0.1088771 0.0424661 -0.0052845 0.0899128 0.0522576 -0.0629031 0.0758431 0.0904841 0.0406118 0.0594087 -0.0409737 0.0759844 -0.0862913 -0.0917253 0.0453192 -0.00097 0.1172915 0.0189103 0.0256934 -0.0547618 0.0809303 -0.0429368 -0.0384107 -0.0890197 0.1124727 -0.1011181 0.1110632 -0.0472775 0.0859282 -0.0860613 0.0690019 0.0307031 0.0321329 -0.0609145 -0.0640212 -0.067087 -0.0371284 -0.0896163 -0.1359845 -0.0942731 -0.0514127 -0.1154907 0.0291958 0.0872959 0.12975 0.0557868 -0.0015514 0.106783 -0.0064433 -0.0121334 0.0261901 0.0560224 -0.1026003 0.0315336 -0.0267658 0.0847219 -0.0884421 0.0929358 0.0759873 0.0577688 -0.0564871 -0.0175929 -0.0729107 -0.1369544 0.1059714 -0.0579294 0.0853598 0.1015259 -0.0529098 -0.0139801 -0.0705347 0.0054323 0.0152508 -0.0788712 0.0328853 -0.0905209 -0.0710492 -0.0536987 0.0066025 0.0127193 -0.0551204 -0.1112558 0.0652404 0.0813951 0.0298914 0.0487315 -0.1249553 0.0496409 0.0890023 0.048349 0.099118 -0.0006594 0.1137849 -0.0102862 0.0240849 0.1029345 -0.0135054 -0.0320351 -0.0282956 0.0188807 -0.1118405 -0.0902283 -0.0805236 -0.0694266 0.0819965 -0.0978337 0.0241642 -0.0539013 -0.0972089 0.0637842 -0.0219666 0.0679354 0.0715798 unknown
polarizability: 128.6426579|-0.0326278|88.4229409|5.8540011|-6.6820484|83.7788409 unknown
InChI: InChI=1S/C9H14O2/c1-2-11-9(10)8-6-4-3-5-7-8/h4,6,8H,2-3,5,7H2,1H3
charge 0 multiplicity 1
25 atoms
O  1.912308 0.160085 0.37762
O  0.873862 1.202705 -1.426605
C  -1.505226 1.743637 0.153459
C  -0.378847 0.834635 0.701953
C  -2.368945 1.012535 -0.899714
C  -3.038658 -0.243617 -0.296268
C  -0.871838 -0.587337 0.982031
C  -2.071987 -1.053628 0.54757
C  0.825519 0.776872 -0.249593
C  3.144728 -0.004202 -0.455074
C  4.167577 -0.733439 0.409694
H  0.010894 1.247057 1.654732
H  -1.067036 2.657787 -0.286284
H  -2.144749 2.053087 1.003552
H  -1.721355 0.722613 -1.747489
H  -3.140368 1.698256 -1.297918
H  -3.450059 -0.882572 -1.103049
H  -3.910018 0.048051 0.329085
H  -0.200532 -1.227693 1.56723
H  -2.37359 -2.075717 0.818543
H  2.875396 -0.570843 -1.364855
H  3.489406 0.998905 -0.765724
H  5.102831 -0.880992 -0.160762
H  4.402952 -0.15245 1.317972
H  3.788938 -1.723038 0.717991
