program: Gaussian 09
title: 000297201
version: EM64L-G09RevD.01
frameworkgroup: C1[X(C8H10O2)]
method: RPBEPBE
basis: SDD
operation: Freq
keyword: #pfreq=noraman
keyword: PBEPBE/SDD
title: #p freq=noraman PBEPBE/SDD
converged: NO NO NO NO
title: Mulliken charges:
elementType: O O C C C C C C C C H H H H H H H H H H
charge: -0.282417 -0.254976 -0.490239 0.261374 -0.457563 -0.333533 -0.202840 -0.200745 0.139431 -0.502534 0.237443 0.237476 0.226383 0.226454 0.258639 0.212638 0.213595 0.229975 0.240719 0.240723
chargesum: 0.00000
title: Mulliken charges with hydrogens summed into heavy atoms:
elementType: O O C C C C C C C C
charge: -0.282417 -0.254976 -0.015321 0.261374 -0.004727 -0.074894 0.009798 0.012849 0.139431 0.208883
polarizability: 1.21258195e+02 -1.52620257e+01 9.49674185e+01 4.97649108e-03 1.43017635e-03 5.09083773e+01
1716.lowfreq: -15.3835 -10.0059 -0.0003 0.0003 0.0006 8.0153 59.6544 81.2230 118.7820
frequency: 59.5627 81.1315 118.6339 148.6924 148.8170 228.6721 298.9169 334.2955 387.4050 417.6788 450.1564 551.7509 625.9195 652.1578 709.0942 746.7126 868.5002 868.9716 917.3101 930.7124 953.0324 960.4028 979.3676 993.7268 1034.1742 1081.0417 1117.6950 1150.5954 1179.0814 1179.3428 1191.0931 1211.6588 1299.9574 1345.7960 1373.9546 1383.9964 1426.0107 1442.5915 1453.0580 1453.0895 1465.5212 1619.2123 1659.6455 1702.1871 2936.6954 2961.0426 2967.0268 2996.2855 2996.7645 3094.5771 3099.6251 3121.0978 3131.8091 3140.5221
redmass: 4.4288 2.6072 1.0935 3.7746 2.5052 2.9703 4.5878 5.6880 2.2535 2.5968 6.7024 6.0710 6.2840 1.3988 2.5616 5.6368 4.6565 1.4450 5.4619 3.1179 1.6130 2.4817 1.4642 1.6815 5.3423 1.4928 1.2678 1.4767 1.0649 1.1081 1.0898 5.3856 1.3658 1.7112 2.4987 1.5794 1.1888 1.1037 1.0758 1.0493 1.0520 10.1711 7.2938 6.5309 1.0601 1.0961 1.0609 1.0301 1.0971 1.1041 1.0840 1.0909 1.0998 1.1040
irintensity: 3.3312 0.0959 1.0992 1.6259 6.8553 0.5753 16.3543 0.2645 0.1933 0.1953 7.0966 0.5330 2.1997 87.9680 0.5072 9.4991 13.4254 1.0534 9.8698 6.9557 3.5623 16.4759 13.7030 2.2875 123.5319 1.3604 0.0343 47.6970 2.1281 0.0313 0.0889 281.3798 1.0062 0.4389 7.3637 3.1696 20.1097 9.3586 28.9906 13.3916 9.0734 184.0155 33.6887 6.2151 36.8185 20.4071 21.6203 38.8416 16.0582 28.4916 7.5248 11.0638 51.6026 18.5571
temp: 298.150 k
press: 1.00000 atm
elementType: 8 8 6 6 6 6 6 6 6 6 1 1 1 1 1 1 1 1 1 1
symmnumber: 1
zpe: 422561.5 jmol-1
zpe.correction: 0.160945 hartree
zpe.thermalcorrener: 0.170855 hartree
zpe.thermalcorrenthalpy: 0.171799 hartree
zpe.thermalcorrgfe: 0.125262 hartree
zpe.sumelectzpe: -460.515981 hartree
zpe.sumelectthermal: -460.506071 hartree
zpe.sumelectthermalent: -460.505127 hartree
zpe.sumelectthermalfe: -460.551664 hartree
dipole: -0.7601 -1.4707 0.0025
dipole: 1.6555
quadrupole: -48.2165 -59.8363 -60.2077
quadrupole: -7.2464 0.0014 0.0062
quadrupole: 7.8704 -3.7495 -4.1209 -7.2464 0.0014 0.0062
hfenergy: -460.676926 hartree
pointgroup: C01 [X(C8H10O2)]
dipole: 0.3151996 -0.5699823 -0.0009815 debye
dipolederiv: -1.1604564 -0.4007364 -0.000015 -0.5919119 -0.8820735 -0.0001551 -0.0002007 -0.0002848 -0.2907504 -0.8426641 0.2378401 0.0002589 0.1894623 -0.8377688 -0.0003854 0.0002087 -0.0003107 -0.3254615 -0.0871469 0.0054065 -0.0001902 -0.0466526 -0.0684082 0.0000603 -0.0008888 -0.0005466 0.2349654 -0.6855996 -0.162388 0.0000809 -0.3285642 0.1141182 0.0001574 0.0003031 0.000492 -0.0793549 -0.1678851 -0.0114088 0.0000111 -0.080193 -0.027899 0.0002207 0.0008697 0.0009252 0.2381072 0.3889282 0.0439319 -0.0003055 0.2753025 0.0402666 0.0000512 -0.0003871 -0.0002272 -0.1596289 0.2196858 -0.0145733 0.0007111 -0.0057774 0.0392662 -0.0004097 0.0009682 -0.0000138 -0.2312096 0.0484625 -0.0683577 0.0005771 -0.1277663 0.1362405 -0.0004933 0.0002415 -0.0008107 -0.2543635 1.7455499 0.2317752 -0.0003834 0.3730263 1.2869058 0.0006067 -0.0001677 0.0005407 0.2327604 0.6840655 0.1574395 0.0000157 0.0788842 0.2492709 -0.0000441 -0.000027 -0.0000537 0.2805593 0.034133 -0.0372766 -0.0618121 -0.0092885 0.0168618 -0.0732734 -0.0796548 -0.1068599 -0.0274127 0.033987 -0.0375891 0.0618677 -0.0096403 0.0166706 0.0733772 0.0797888 0.1067715 -0.0265393 -0.0126061 -0.0267325 -0.0643363 0.0086844 -0.0101222 -0.0884102 -0.1029936 -0.1366288 -0.030064 -0.0124598 -0.0265336 0.0642932 0.0089468 -0.0094094 0.0882265 0.1027245 0.13654 -0.0308158 0.053111 0.0817243 -0.0000057 0.0723368 -0.0270414 -0.0000513 0.0000162 -0.0001705 0.1489658 -0.0086893 0.0904201 -0.0002463 0.1189701 -0.1167476 0.000377 -0.0002719 0.0004647 0.1585727 -0.1791096 0.0494296 -0.0004631 0.051853 0.0516332 0.0001297 -0.000547 0.0001176 0.1637151 0.0287513 -0.0550502 -0.0000061 -0.1185763 -0.0975566 -0.0000678 -0.000031 -0.0000779 0.1182225 -0.0400537 -0.0286313 -0.0239176 0.0705102 0.0628181 0.0992161 -0.0729287 0.0664193 -0.0600392 -0.0400035 -0.0286898 0.0238657 0.0703941 0.0629748 -0.0991326 0.0729779 -0.0662865 -0.0602286 unknown
polarizability: 120.379351|15.9769381|95.8462625|0.0050147|-0.0012897|50.9083773 unknown
InChI: InChI=1S/C8H10O2/c1-10-8(9)7-5-3-2-4-6-7/h2-3,6H,4-5H2,1H3
charge 0 multiplicity 1
20 atoms
O  -2.101208 -0.829634 -0.000431
O  -1.962197 1.498802 0.000783
C  0.600949 -1.298914 -0.001253
C  0.084035 0.130819 -0.000515
C  2.415015 1.13218 -0.001003
C  0.907553 1.218673 -0.000441
C  2.115851 -1.378333 0.001115
C  2.932548 -0.294773 0.001186
C  -1.388373 0.381977 0.000082
C  -3.571763 -0.691793 0.000035
H  0.191374 -1.842308 -0.8774
H  0.188337 -1.844456 0.872047
H  2.814886 1.687418 0.876161
H  2.813937 1.684266 -0.88064
H  0.451618 2.218227 0.00014
H  2.54914 -2.387978 0.002847
H  4.023059 -0.426423 0.002972
H  -3.953813 -1.722758 -0.000335
H  -3.908313 -0.144287 -0.897666
H  -3.907828 -0.145104 0.898415
