program: Gaussian 09
title: 000297183
version: EM64L-G09RevD.01
frameworkgroup: C1[X(C7H8O)]
method: RPBEPBE
basis: SDD
operation: Freq
keyword: #p
keyword: freq=noraman
keyword: PBEPBE/SDD
title: #p freq=noraman PBEPBE/SDD
converged: YES YES NO NO
title: Mulliken charges:
elementType: O C C C C C C C H H H H H H H H
charge: -0.163241 -0.281680 -0.182164 -0.542108 0.118771 -0.477134 -0.241186 -0.204722 0.271519 0.248821 0.248016 0.258202 0.225765 0.243897 0.242790 0.234456
chargesum: 0.00000
title: Mulliken charges with hydrogens summed into heavy atoms:
elementType: O C C C C C C C
charge: -0.163241 -0.010162 0.066657 -0.035891 0.118771 -0.007472 0.001604 0.029733
polarizability: 7.31375962e+01 2.28233303e+00 7.91538612e+01 1.28708975e+00 6.10671063e-01 5.47212798e+01
1716.lowfreq: -25.1684 -8.9085 -6.2916 -0.0003 0.0003 0.0004 71.6702 203.0337 250.2649
frequency: 71.5605 203.0255 250.2610 400.6700 449.4631 518.8018 593.6734 700.7685 726.1343 741.1714 754.4105 840.6928 871.2926 923.4714 931.1392 952.1350 974.9063 1012.4344 1028.6231 1059.7619 1084.9545 1104.5687 1137.9871 1148.3865 1184.2070 1214.9076 1225.5684 1268.1983 1290.9406 1333.4775 1411.9846 1462.8936 1622.6025 1714.1843 2983.8938 3005.4385 3031.9971 3040.7654 3055.7070 3082.5184 3136.5645 3170.2697
redmass: 4.0634 3.3140 2.3732 3.1585 2.5216 2.4214 4.6853 1.9083 3.1908 1.7745 3.2939 2.4482 2.5970 1.4053 2.5361 1.3176 3.0882 1.8738 1.9530 2.5592 1.3873 1.1472 1.5796 1.3124 1.5821 1.4361 1.7696 1.3884 1.6440 1.8048 1.0954 1.0911 6.2234 12.4742 1.0608 1.0606 1.0990 1.0875 1.0891 1.1030 1.0859 1.1065
irintensity: 4.6123 2.2407 0.7798 0.5663 5.3331 0.6183 0.6505 36.5609 8.7413 29.2996 2.4390 3.1180 1.6319 5.1274 15.9599 1.6162 6.1086 1.4960 3.6924 46.5605 12.7187 4.8018 5.2333 9.6830 6.0384 4.4150 13.6879 2.7613 3.8767 7.4075 20.8472 12.2661 4.5801 234.0234 39.4095 14.6280 16.9784 13.2102 30.9439 13.8656 5.0488 27.3262
temp: 298.150 k
press: 1.00000 atm
elementType: 8 6 6 6 6 6 6 6 1 1 1 1 1 1 1 1
symmnumber: 1
zpe: 339239.5 jmol-1
zpe.correction: 0.129209 hartree
zpe.thermalcorrener: 0.135827 hartree
zpe.thermalcorrenthalpy: 0.136771 hartree
zpe.thermalcorrgfe: 0.098250 hartree
zpe.sumelectzpe: -346.128167 hartree
zpe.sumelectthermal: -346.121550 hartree
zpe.sumelectthermalent: -346.120605 hartree
zpe.sumelectthermalfe: -346.159127 hartree
dipole: -2.3248 1.5250 1.2434
dipole: 3.0457
quadrupole: -53.3493 -44.9870 -45.8413
quadrupole: 5.2517 4.0266 -1.1641
quadrupole: -5.2901 3.0722 2.2179 5.2517 4.0266 -1.1641
hfenergy: -346.2573768 hartree
pointgroup: C01 [X(C7H8O1)]
dipole: -0.94948 0.5326417 0.5005922 debye
dipolederiv: -0.8644726 0.2401321 0.201051 0.3367157 -0.573793 -0.0817956 0.3233003 -0.098102 -0.4195607 -0.2862567 -0.105418 0.2271337 -0.1457882 -0.107558 0.0952534 0.2210769 0.0685253 -0.0178667 0.0332633 -0.0195466 -0.0794685 -0.0195269 -0.030942 0.0639526 -0.0772678 0.1103152 0.1546524 -0.0223598 0.1017973 0.0529485 0.0914286 -0.4601722 0.0445691 0.0783052 0.0008618 0.0857525 0.9793088 -0.2391298 -0.4075043 -0.2877246 0.916462 -0.0711604 -0.5854957 -0.04386 0.3649074 0.0914722 0.048336 -0.1114698 0.0931893 0.0126099 -0.0313112 -0.0572097 0.0370045 0.0851007 -0.0150927 -0.00767 0.1638353 0.0297982 -0.023846 0.0120446 0.2486524 -0.0045681 -0.1478686 -0.078681 -0.0556988 0.1775787 -0.1018093 0.0940474 -0.0159553 0.1337956 -0.0534971 -0.095418 0.0396467 0.0041212 -0.0654973 0.0260812 0.081501 0.0424688 -0.0644438 0.0447879 -0.0749143 0.0170364 0.0038987 0.0312348 0.0376792 -0.0172675 -0.1064943 0.0292224 -0.128208 -0.0797918 -0.0333638 -0.0927256 -0.0618952 -0.0620111 0.0353343 -0.0465419 -0.069193 -0.0861631 0.0468301 0.0842705 0.0464101 -0.0016743 -0.0087599 0.0672395 0.0440962 0.0193035 0.0883429 -0.06575 -0.013059 -0.0644644 0.0706525 -0.0782413 -0.0174541 0.0880006 0.0541048 0.1450635 -0.0295679 0.0421885 0.1063815 0.0365209 0.0386029 -0.0278059 -0.0661851 0.0288054 -0.0985194 0.0212235 0.0343433 0.0704115 -0.094793 0.0881715 -0.0140256 0.0601723 -0.1182175 0.054396 0.1027637 -0.008244 -0.0368352 -0.138653 -0.0378049 0.06567 -0.031114 -0.164739 -0.0363794 0.0695076 unknown
polarizability: 72.8773249|1.8590149|79.404929|1.1781067|0.9941142|54.7304832 unknown
InChI: InChI=1S/C7H8O/c8-7-4-5-2-1-3-6(5)7/h1-2,5-6H,3-4H2
charge 0 multiplicity 1
16 atoms
O  2.273096 -0.730572 -0.553164
C  0.123281 -0.446187 0.823076
C  -0.421534 1.021833 0.573702
C  0.928679 1.420841 -0.14611
C  1.345821 -0.067436 -0.055257
C  -0.890527 -1.448449 0.198199
C  -1.604295 0.787531 -0.34831
C  -1.846061 -0.5343 -0.563457
H  0.409521 -0.696991 1.859269
H  -0.665683 1.633822 1.458041
H  1.588175 2.079573 0.449989
H  0.852136 1.82793 -1.169139
H  -1.424577 -2.033512 0.972392
H  -0.385378 -2.179301 -0.462081
H  -2.178759 1.609327 -0.788906
H  -2.641993 -0.92901 -1.204543
