program: Gaussian 09
title: 000297199
version: EM64L-G09RevD.01
frameworkgroup: C1[X(C10H14O4)]
method: RPBEPBE
basis: SDD
operation: Freq
keyword: #pfreq=noraman
keyword: PBEPBE/SDD
title: #p freq=noraman PBEPBE/SDD
converged: YES YES NO NO
title: Mulliken charges:
elementType: O O O O C C C C C C C C C C H H H H H H H H H H H H H H
charge: -0.283535 -0.272077 -0.233346 -0.240315 -0.203330 -0.458989 -0.208311 -0.472287 -0.205578 -0.181549 0.233663 0.256868 -0.513338 -0.511856 0.248336 0.214661 0.254436 0.233679 0.252259 0.219199 0.220138 0.206576 0.220708 0.246474 0.263385 0.238513 0.242430 0.233187
chargesum: 0.00000
title: Mulliken charges with hydrogens summed into heavy atoms:
elementType: O O O O C C C C C C C C C C
charge: -0.283535 -0.272077 -0.233346 -0.240315 0.045006 0.010108 0.025368 -0.000829 0.014560 0.025027 0.233663 0.256868 0.217229 0.202274
polarizability: 1.37923687e+02 3.62810563e+00 1.03173474e+02 4.39901165e+00 -2.38012280e+00 9.69777359e+01
1716.lowfreq: -12.1086 -5.0608 -0.0006 -0.0002 0.0003 12.2317 34.3604 49.0328 69.9424
frequency: 33.8532 48.8450 69.8866 78.3220 99.6143 108.0295 120.1960 164.2244 184.2564 192.0137 253.0030 269.0461 315.5225 331.4781 365.0095 393.2522 432.0442 509.0826 537.2244 561.8499 610.4286 680.6777 701.8820 729.6163 763.6018 806.5406 842.7567 883.6784 916.4387 930.3187 939.5528 943.4073 976.4614 992.7389 1038.8992 1094.8615 1103.1428 1110.2531 1116.0324 1120.0587 1138.9025 1147.8814 1150.7433 1158.0723 1200.7786 1221.7964 1255.2535 1286.0355 1299.4937 1319.6176 1348.5643 1354.2220 1386.5947 1417.9572 1419.2659 1447.3914 1451.1359 1453.1838 1463.8927 1468.7024 1470.3312 1637.0727 1642.4360 1681.8191 2967.9759 2978.5502 2981.7050 3001.5713 3004.8004 3013.3529 3043.8323 3090.8700 3101.7927 3107.2265 3113.0772 3137.9444 3142.1036 3144.9985
redmass: 6.4837 4.9684 4.0751 2.9410 1.4482 1.3213 1.8977 3.7592 4.1500 3.8850 2.9195 4.1274 3.7352 2.7564 4.4907 2.9184 3.6924 6.4280 3.6446 5.3798 3.0920 3.2742 3.4115 2.6326 4.0374 3.0925 4.3929 3.4312 2.4302 4.8905 2.8489 3.6759 1.3427 2.9157 2.5309 1.6622 2.2335 1.3602 1.8379 1.5822 1.2985 1.4249 1.4183 2.3061 1.1007 1.1029 1.6389 1.9340 1.6093 1.4502 1.5383 1.4388 1.5945 1.1821 1.1768 1.0882 1.0504 1.0510 1.0502 1.0735 1.0598 9.9767 9.4857 6.9196 1.0714 1.0794 1.0763 1.0296 1.0285 1.0685 1.0940 1.0977 1.1042 1.0844 1.1050 1.0992 1.1055 1.1045
irintensity: 0.3061 1.1660 0.1651 4.0308 0.9591 0.8631 0.3373 2.6305 1.2820 7.4748 12.6900 11.0233 12.4196 4.4596 4.4208 7.1640 1.6855 3.5293 0.1619 2.8449 2.6824 19.5842 23.0536 35.4443 9.3250 1.2577 7.9296 6.7636 4.6732 5.5625 7.2005 17.1560 2.1197 10.0610 111.0957 45.7064 64.6105 0.1209 19.6532 44.1658 103.6473 7.5996 0.7611 175.6142 6.1631 11.4943 6.9318 9.6514 39.5789 8.5703 2.7285 2.3330 0.5835 15.8966 23.4902 21.5837 1.7892 24.4114 13.6158 14.1827 12.1523 60.9773 246.0163 2.1278 23.2418 4.1806 38.5288 31.4374 33.7583 45.4720 6.9520 12.1667 32.5652 5.6797 16.0720 38.9897 15.9600 17.2000
temp: 298.150 k
press: 1.00000 atm
elementType: 8 8 8 8 6 6 6 6 6 6 6 6 6 6 1 1 1 1 1 1 1 1 1 1 1 1 1 1
symmnumber: 1
zpe: 592265.4 jmol-1
zpe.correction: 0.225582 hartree
zpe.thermalcorrener: 0.240329 hartree
zpe.thermalcorrenthalpy: 0.241273 hartree
zpe.thermalcorrgfe: 0.182863 hartree
zpe.sumelectzpe: -689.258655 hartree
zpe.sumelectthermal: -689.243908 hartree
zpe.sumelectthermalent: -689.242963 hartree
zpe.sumelectthermalfe: -689.301374 hartree
dipole: 1.6784 -0.5536 2.6331
dipole: 3.1713
quadrupole: -72.3414 -78.4952 -86.3961
quadrupole: 7.2826 -2.8649 2.6108
quadrupole: 6.7362 0.5824 -7.3185 7.2826 -2.8649 2.6108
hfenergy: -689.4842368 hartree
pointgroup: C01 [X(C10H14O4)]
dipole: 0.6583355 -0.0008613 -1.0598419 debye
polarizability: 136.8619788|-7.3331459|103.3408023|-4.2304582|-2.8224126|97.8721166 unknown
InChI: InChI=1S/C10H14O4/c1-13-9(11)7-4-3-5-8(6-7)10(12)14-2/h3-4,7-8H,5-6H2,1-2H3
charge 0 multiplicity 1
28 atoms
O  0.05926 -1.932572 -0.279053
O  2.492485 0.51771 -0.733295
O  -1.859548 -1.787653 1.024585
O  1.513683 0.296897 1.36778
C  -1.61226 -0.308479 -0.953565
C  -0.44085 0.508839 -1.556628
C  0.280253 1.413612 -0.505486
C  -2.659804 0.631667 -0.309184
C  -0.687145 2.012131 0.499454
C  -2.004388 1.690696 0.557503
C  -1.182729 -1.384048 0.053276
C  1.442533 0.684562 0.181116
C  0.584668 -2.946013 0.669198
C  3.672543 -0.220624 -0.229597
H  -2.095088 -0.865656 -1.783945
H  -0.869892 1.170357 -2.333016
H  0.292127 -0.150999 -2.047868
H  0.761907 2.234483 -1.075693
H  -3.358566 0.035353 0.30551
H  -3.265574 1.111941 -1.105145
H  -0.274419 2.751667 1.1973
H  -2.647143 2.199014 1.288449
H  1.423024 -3.422889 0.14107
H  -0.199306 -3.678018 0.923458
H  0.927309 -2.433098 1.583428
H  3.385608 -1.246792 0.056861
H  4.102864 0.292254 0.647138
H  4.379748 -0.229742 -1.070951
