program: Gaussian 09
title: 000297173
version: EM64L-G09RevD.01
frameworkgroup: C1[X(C8H8Cl2O3)]
method: RPBEPBE
basis: SDD
operation: Freq
keyword: #p
keyword: freq=noraman
keyword: PBEPBE/SDD
title: #p freq=noraman PBEPBE/SDD
converged: YES YES NO NO
title: Mulliken charges:
elementType: Cl Cl O O O C C C C C C C C H H H H H H H H
charge: -0.035398 -0.061964 -0.192186 -0.142529 -0.147713 -0.245934 -0.245411 -0.410620 -0.412329 -0.386676 -0.369801 0.179152 0.168035 0.291442 0.303742 0.246744 0.279956 0.254967 0.276837 0.324568 0.325117
chargesum: 0.00000
title: Mulliken charges with hydrogens summed into heavy atoms:
elementType: Cl Cl O O O C C C C C C C C
charge: -0.035398 -0.061964 -0.192186 -0.142529 -0.147713 0.045508 0.058331 0.116081 0.119475 -0.062108 -0.044684 0.179152 0.168035
polarizability: 1.05267565e+02 7.08160728e+00 1.19564683e+02 -9.52010415e+00 -1.58136697e-01 8.98532995e+01
1716.lowfreq: -25.7794 -8.1813 -0.0003 0.0026 0.0030 5.3920 50.3877 69.6972 117.7018
frequency: 50.2624 69.6630 117.7002 137.3949 148.5323 193.0663 213.6816 266.7633 320.1430 337.4625 350.6162 429.7996 487.9424 517.8626 564.9188 574.3361 606.7117 633.0939 673.3689 703.6342 714.4317 804.6592 820.6329 839.7801 871.1925 915.5969 950.1717 998.3803 1019.1906 1081.2444 1104.8930 1117.7697 1157.3005 1181.6746 1182.4006 1217.5811 1229.6376 1244.2127 1257.3087 1295.3858 1321.1511 1330.9797 1348.6189 1358.0469 1369.9577 1448.7178 1451.5114 1706.5804 1775.9721 2976.8045 3003.0744 3013.5469 3069.1583 3074.3862 3090.2545 3098.8218 3108.4643
redmass: 13.8844 12.5139 10.9220 14.8300 11.9016 7.2015 5.3084 6.9100 2.7975 2.2500 9.9397 6.8493 6.4174 5.0336 6.1571 6.2445 6.2049 4.5526 5.8005 6.0261 4.7326 4.9857 4.1200 4.7092 2.7033 3.4531 2.4947 2.2729 2.7124 1.8954 2.2486 3.4211 1.2687 1.3556 1.2624 1.2693 1.3705 1.1902 1.8980 1.5571 1.3659 1.6235 1.4913 1.3912 1.4211 1.0722 1.0806 12.7431 12.6718 1.0809 1.0651 1.0632 1.0860 1.0996 1.0965 1.0873 1.0902
irintensity: 0.7167 0.8179 3.6253 4.4677 5.7472 8.2305 4.7460 0.7084 1.4433 3.0848 11.9238 3.2220 1.7868 24.7647 3.4860 39.0841 2.4392 8.1309 28.0418 15.5352 9.2352 88.5353 187.8063 46.3958 6.2959 41.1296 1.7529 30.4500 61.4255 13.3041 45.6215 113.5616 11.3925 2.4205 6.3099 2.8714 6.6095 5.0691 3.8995 3.7245 0.4975 7.9998 0.5567 3.0191 1.4387 43.9193 3.4363 475.1332 90.7636 7.9301 3.8871 10.2094 2.3822 1.2872 4.7640 2.3967 5.7406
temp: 298.150 k
press: 1.00000 atm
elementType: 17 17 8 8 8 6 6 6 6 6 6 6 6 1 1 1 1 1 1 1 1
symmnumber: 1
zpe: 394447.3 jmol-1
zpe.correction: 0.150237 hartree
zpe.thermalcorrener: 0.161845 hartree
zpe.thermalcorrenthalpy: 0.162790 hartree
zpe.thermalcorrgfe: 0.111514 hartree
zpe.sumelectzpe: -1454.489571 hartree
zpe.sumelectthermal: -1454.477963 hartree
zpe.sumelectthermalent: -1454.477019 hartree
zpe.sumelectthermalfe: -1454.528294 hartree
dipole: -4.3949 -0.8093 1.9215
dipole: 4.8644
quadrupole: -105.5472 -101.5478 -83.5056
quadrupole: -2.7572 4.4698 -1.4506
quadrupole: -8.6803 -4.6810 13.3613 -2.7572 4.4698 -1.4506
hfenergy: -1454.6398083 hartree
pointgroup: C01 [X(C8H8Cl2O3)]
dipole: 1.6655316 0.3715881 0.8663297 debye
dipolederiv: -0.207618 -0.0527292 -0.0539489 -0.045051 -0.3815545 -0.2080895 -0.0077091 -0.1746152 -0.4592292 -0.3400945 -0.1087261 -0.1335378 -0.1380145 -0.4090929 -0.1853309 -0.1872152 -0.1691039 -0.3765082 -0.6171147 0.2185898 -0.1517489 0.1956929 -1.6963505 0.2763139 -0.2276407 0.2302981 -0.2822951 -0.4870579 -0.1181056 -0.0502357 -0.0781681 -1.0863754 0.084073 -0.0764048 -0.0031729 -0.3076186 -0.6779904 0.3325806 -0.093599 0.2931541 -0.9539266 0.1180756 -0.1680767 0.1728987 -0.3336124 -0.1080913 -0.0271027 -0.1162956 -0.1293774 -0.0674601 -0.0388478 -0.1956741 -0.0427646 -0.0106096 -0.4030729 0.0178149 -0.0739251 0.03381 0.0445273 0.0497791 -0.0311599 0.0353033 0.0831058 0.1183911 -0.0743871 -0.0119726 -0.0571687 -0.0611672 -0.0027353 0.0710052 -0.0035847 -0.0605308 -0.0042766 0.0373466 -0.0565373 0.0432523 -0.0529388 -0.0150503 -0.2501683 -0.0599635 -0.0053237 0.1379412 0.1188022 0.0452734 0.0974256 0.3855324 0.268926 -0.0949685 0.2250736 0.5594879 0.4012235 0.1235373 0.2006406 0.1217379 0.4311828 0.2532618 0.3747174 0.2391538 0.3487437 0.9274317 -0.3907356 0.3318864 0.0159744 1.7446393 -0.1862613 0.394281 -0.2502026 0.4452229 1.0972076 0.0255923 0.1477064 -0.3062021 1.8877071 -0.2359398 0.3077013 -0.0628819 0.2566166 0.0244306 -0.0107852 0.0564784 -0.018292 0.0686852 -0.0088984 0.0770068 0.0146831 -0.0213926 0.0988145 -0.0373773 -0.0191886 -0.0014777 -0.0019124 -0.0419321 0.001373 -0.0454868 0.020715 -0.0174129 0.0128165 -0.0177569 -0.0222546 0.1059381 -0.0831257 -0.0511921 -0.0448835 -0.0417744 0.0770749 -0.0270788 0.0301853 0.0280291 -0.046143 0.0431652 0.0205021 -0.0018486 0.113651 0.015165 -0.0424276 -0.0593545 -0.0267895 0.0838505 -0.0817214 -0.0081166 -0.0530344 0.0088077 0.0540576 0.0074707 0.0233475 -0.0026508 -0.059184 0.0591385 0.0457679 0.0324896 0.0833384 -0.0489546 0.0361329 -0.0187055 0.025302 0.0259184 -0.0400897 -0.0088822 -0.0277363 0.0053902 -0.040054 -0.0412287 0.0212886 -0.0289319 0.0381242 -0.0247109 0.0148535 -0.0106212 -0.0261845 unknown
polarizability: 103.562144|2.3555772|118.8104727|10.2252521|8.6391507|92.3129305 unknown
InChI: InChI=1S/C8H8Cl2O3/c9-5-1-3-4(2-6(5)10)8(12)13-7(3)11/h3-6H,1-2H2
charge 0 multiplicity 1
21 atoms
Cl 1.494602 -1.780674 -1.63939
Cl 2.81696 1.694371 0.888531
O  -2.334317 -0.215911 -0.249195
O  -1.598106 -2.383588 0.244436
O  -2.461639 2.112228 -0.435867
C  -0.295285 -0.387259 1.039362
C  -0.366533 1.030328 0.411437
C  1.082123 -1.086596 1.086574
C  0.595462 1.237975 -0.797146
C  2.012271 -0.773377 -0.090293
C  1.997954 0.69416 -0.532123
C  -1.40058 -1.172322 0.317233
C  -1.803455 1.124003 -0.108295
H  -0.660147 -0.312825 2.085144
H  -0.181438 1.824559 1.152191
H  1.612702 -0.760169 2.00068
H  0.936857 -2.17826 1.165379
H  0.215834 0.705157 -1.691158
H  0.641625 2.310093 -1.048529
H  3.035863 -1.123834 0.105736
H  2.671045 0.864543 -1.385005
