program: Gaussian 09
title: 000297213
version: EM64L-G09RevD.01
frameworkgroup: C1[X(C15H13N3O4)]
method: RPBEPBE
basis: SDD
operation: Freq
keyword: #p
keyword: freq=noraman
keyword: PBEPBE/SDD
title: #p freq=noraman PBEPBE/SDD
converged: YES YES NO NO
title: Mulliken charges:
elementType: O O O O N N N C C C C C C C C C C C C C C C H H H H H H H H H H H H H
charge: -0.245667 -0.224238 -0.233943 -0.214936 -0.132319 -0.091957 -0.376562 0.175620 -0.228224 -0.541968 -0.228821 -0.195956 0.199609 0.217596 0.159335 0.464883 -0.347934 -0.350020 -0.496105 -0.224246 -0.223103 -0.243558 0.296477 0.281243 0.266658 0.287145 0.261836 0.286554 0.276786 0.243139 0.239810 0.255080 0.228751 0.228897 0.230138
chargesum: 0.00000
title: Mulliken charges with hydrogens summed into heavy atoms:
elementType: O O O O N N N C C C C C C C C C C C C C C C
charge: -0.245667 -0.224238 -0.233943 -0.214936 -0.132319 -0.091957 -0.376562 0.175620 0.068252 0.005932 0.058324 0.065880 0.199609 0.217596 0.159335 0.464883 -0.061380 -0.073233 0.241925 0.004505 0.005795 -0.013420
polarizability: 2.47467803e+02 4.44132962e+00 1.99251652e+02 -3.28676372e+00 1.10973631e+00 1.18209892e+02
1716.lowfreq: -7.6662 -3.2909 0.0004 0.0007 0.0008 11.6941 27.2297 30.2828 48.4921
frequency: 27.1803 30.2692 48.4412 56.1078 75.7273 87.0415 112.9696 117.1528 146.6555 165.8147 192.3940 268.0703 278.9272 284.6271 294.7149 316.6233 349.0906 363.9855 391.1836 402.8302 432.9237 442.1526 502.3473 517.0040 531.0623 610.8721 615.5253 618.5038 631.2792 652.6816 691.9089 704.0779 706.5754 736.2067 742.5764 743.4360 771.8335 780.2089 791.0757 841.0677 868.0484 880.7941 898.9781 917.0108 919.9546 924.0311 946.3996 973.4585 989.5744 993.8195 1000.3291 1025.6782 1033.2271 1040.1117 1059.9695 1068.8992 1086.8558 1101.6711 1108.3334 1115.1494 1151.8445 1160.6099 1175.9772 1197.8183 1199.9830 1222.0588 1239.5902 1249.2617 1260.9030 1282.3392 1320.9037 1329.7196 1332.2253 1382.7370 1424.8447 1445.6811 1453.5277 1458.1342 1460.7838 1489.2675 1561.1345 1592.8443 1612.6730 1637.7833 1642.8749 1688.7924 3010.0868 3066.4814 3115.6482 3131.6466 3144.0567 3155.1564 3157.2326 3159.0316 3162.7962 3188.7838 3188.9075 3193.6905 3217.9750
redmass: 4.1246 4.6912 5.2938 3.9235 8.2349 1.2268 6.1167 5.0325 4.8626 5.6635 5.9941 5.7318 5.7679 5.7389 4.7876 7.4478 5.7518 6.8479 5.7044 2.8655 4.6465 3.6314 2.9735 3.5417 4.5458 6.2610 9.9597 5.0886 5.9199 11.7069 2.0567 4.8123 7.6496 4.8973 2.2512 5.0171 2.1083 4.7989 5.3752 1.2515 4.1117 3.3044 4.0282 2.0108 1.4435 2.0294 2.2020 1.4167 5.4832 1.3255 3.6654 2.9455 2.7667 3.3296 2.3276 2.6506 2.4755 1.7326 2.1346 1.3508 1.4706 1.5271 1.0490 1.3197 1.6590 3.9715 4.4709 1.5241 1.6674 2.4043 3.0189 6.4085 1.3347 8.7597 1.2158 2.3464 1.0495 1.0996 1.0512 2.3224 6.0843 6.3472 5.8838 10.6905 11.9281 12.6782 1.0294 1.0593 1.1050 1.0855 1.0909 1.1092 1.0930 1.1051 1.0976 1.0948 1.0895 1.0956 1.1092
irintensity: 0.3631 1.1456 3.8491 0.0325 0.4110 0.3710 2.9454 8.2330 4.2949 3.5962 4.8510 5.2011 2.8468 16.4587 3.2181 3.3858 1.9758 2.1916 2.9614 0.7729 2.4848 8.7914 5.4482 19.8185 3.0482 2.3055 18.5456 18.1805 4.6120 1.6430 33.4652 4.5414 21.9135 4.9884 94.1344 50.5589 59.7071 13.7322 19.9725 0.1585 2.4882 7.3728 7.6771 0.6522 6.6666 13.7028 7.5321 0.4131 0.0452 0.9663 26.2200 35.0706 11.1577 31.0258 23.1704 77.9497 38.8853 13.0294 112.5103 15.6175 37.4315 5.8672 0.4107 24.8129 9.8720 59.1975 186.5464 30.7726 5.3390 98.1187 33.0098 405.5416 11.5769 0.3507 23.0402 22.0222 14.2141 13.3665 10.8869 115.7770 19.3086 3.3063 25.7501 131.2950 614.5360 87.2643 29.0062 10.5941 18.8004 0.0212 20.6596 6.0349 5.9947 11.2890 31.0317 1.5867 0.9803 4.8011 1.4617
temp: 298.150 k
press: 1.00000 atm
elementType: 8 8 8 8 7 7 7 6 6 6 6 6 6 6 6 6 6 6 6 6 6 6 1 1 1 1 1 1 1 1 1 1 1 1 1
symmnumber: 1
zpe: 681220.8 jmol-1
zpe.correction: 0.259463 hartree
zpe.thermalcorrener: 0.277911 hartree
zpe.thermalcorrenthalpy: 0.278856 hartree
zpe.thermalcorrgfe: 0.211221 hartree
zpe.sumelectzpe: -1042.937637 hartree
zpe.sumelectthermal: -1042.919189 hartree
zpe.sumelectthermalent: -1042.918245 hartree
zpe.sumelectthermalfe: -1042.985879 hartree
dipole: 2.6526 0.5893 -0.8141
dipole: 2.8366
quadrupole: -110.8517 -117.8674 -131.3519
quadrupole: 6.0996 -11.9729 9.9953
quadrupole: 9.1720 2.1563 -11.3283 6.0996 -11.9729 9.9953
hfenergy: -1043.1971006 hartree
pointgroup: C01 [X(C15H13N3O4)]
dipole: -1.0463147 0.1451863 0.3600425 debye
polarizability: 247.5026082|-0.7789123|198.8621601|-7.4881035|1.4171365|118.5645788 unknown
InChI: InChI=1S/C15H13N3O4/c1-22-12(19)15-8-7-11(9-15)17-13(20)16(14(21)18(15)17)10-5-3-2-4-6-10/h2-8,11H,9H2,1H3
charge 0 multiplicity 1
35 atoms
O  -3.135479 -1.85807 0.895856
O  0.086995 -1.777002 -0.567381
O  1.414215 2.573727 0.837519
O  -3.819337 -1.410018 -1.288289
N  -1.021613 0.0179 0.529208
N  -0.620941 1.350389 0.954828
N  1.205565 0.232452 0.220356
C  -2.387303 0.185442 -0.116823
C  -1.76484 2.265287 0.5341
C  -2.944047 1.292766 0.853262
C  -2.15825 1.006399 -1.396736
C  -1.780021 2.260128 -1.00392
C  0.092829 -0.647492 -0.023931
C  0.752646 1.521728 0.671555
C  -3.174756 -1.104572 -0.260915
C  2.583709 -0.124066 -0.006869
C  3.542914 0.875614 -0.3097
C  2.974469 -1.484234 0.087354
C  -3.83951 -3.165161 0.834675
C  4.890308 0.505433 -0.508773
C  4.32345 -1.836294 -0.124476
C  5.289001 -0.847131 -0.421011
H  -1.710874 3.221802 1.063866
H  -2.975272 0.963619 1.902833
H  -3.913004 1.684956 0.515955
H  -2.207171 0.579533 -2.399269
H  -1.433421 3.08271 -1.631783
H  3.242254 1.923469 -0.365561
H  2.232097 -2.25571 0.302589
H  -4.902376 -3.015293 0.581998
H  -3.72079 -3.590824 1.839936
H  -3.364674 -3.804064 0.072215
H  5.628088 1.282537 -0.736468
H  4.618092 -2.889015 -0.054262
H  6.335747 -1.126943 -0.581336
