program: Gaussian 09
title: 000297181
version: EM64L-G09RevD.01
frameworkgroup: C1[X(C14H15NO4)]
method: RPBEPBE
basis: SDD
operation: Freq
keyword: #p
keyword: freq=noraman
keyword: PBEPBE/SDD
title: #p freq=noraman PBEPBE/SDD
converged: YES YES NO NO
title: Mulliken charges:
elementType: O O O O N C C C C C C C C C C C C C C H H H H H H H H H H H H H H H
charge: -0.311013 -0.238281 -0.201192 -0.202499 0.027555 0.432533 -0.249510 -0.497756 -0.485355 -0.514638 -0.462661 -0.444383 0.169218 0.234739 -0.319033 -0.317796 -0.354993 -0.346024 0.386650 0.264431 0.253369 0.217954 0.232140 0.226327 0.213944 0.259355 0.227766 0.212656 0.228694 0.215229 0.281652 0.281295 0.290711 0.288920
chargesum: 0.00000
title: Mulliken charges with hydrogens summed into heavy atoms:
elementType: O O O O N C C C C C C C C C C C C C C
charge: -0.311013 -0.238281 -0.201192 -0.202499 0.027555 0.432533 0.014921 -0.026433 -0.026888 -0.041339 -0.022240 -0.000460 0.169218 0.234739 -0.037382 -0.036501 -0.064282 -0.057105 0.386650
polarizability: 2.58314380e+02 -1.81169134e+00 1.64571502e+02 -1.42944105e+00 -2.56877306e+00 1.04648807e+02
1716.lowfreq: -21.2516 -4.0451 -0.0010 -0.0009 -0.0008 9.7809 25.6257 32.6543 56.1104
frequency: 23.7511 32.4648 55.8481 62.9079 76.1715 90.2649 107.4253 153.8366 179.9080 228.0916 239.2176 247.9020 281.4461 346.4170 371.9089 383.9871 410.7182 413.2999 461.9149 486.9512 518.0555 559.1768 585.7559 623.4692 630.0754 652.4069 685.2755 692.6940 736.7231 763.8690 766.9730 790.4718 810.4634 816.4465 835.8492 864.0453 877.8332 888.2623 898.6817 928.8661 945.8945 971.3358 981.2640 1003.3852 1004.3092 1005.8279 1012.1886 1058.1882 1063.7840 1065.2092 1089.7180 1107.5309 1138.0099 1143.5616 1164.4129 1175.7167 1185.2430 1201.7586 1214.4957 1218.2104 1223.7776 1238.8387 1252.1970 1258.0342 1279.2458 1291.9289 1299.5952 1306.5372 1318.7159 1368.1387 1405.4998 1414.6359 1448.5860 1459.1724 1464.4876 1466.8869 1474.3798 1486.7744 1587.6239 1608.8885 1615.6699 2990.7034 2999.9777 3001.1470 3021.9664 3034.0254 3055.8120 3060.7006 3069.9518 3088.3837 3089.2950 3111.3556 3164.0240 3175.6591 3187.4349 3193.3127
redmass: 5.4016 4.6034 5.3087 6.4775 3.7573 7.7946 3.1086 4.5361 5.3277 2.3068 3.6154 6.7561 8.0700 2.4313 3.8825 3.0685 2.8943 4.1064 4.1639 9.3431 6.3954 2.6419 2.4473 6.9078 5.3094 6.2414 3.9387 6.4719 1.3852 5.1581 6.8412 2.3249 7.2044 2.0144 2.3200 1.2462 1.8241 1.6626 2.4745 2.3416 2.1518 1.7585 2.0751 1.9828 1.3915 2.6517 1.3676 1.4055 5.0940 1.5727 3.2197 1.3232 2.2822 2.0069 1.7773 1.2622 1.3356 1.5845 4.5985 1.7522 1.6646 1.5599 3.0869 1.5920 1.5748 1.2603 1.4254 1.3975 1.5099 7.8006 8.2942 4.5753 1.0874 1.0896 1.1067 1.0874 2.4308 1.0927 9.5271 6.5290 10.0452 1.0615 1.0673 1.0620 1.0584 1.0628 1.0996 1.0907 1.1009 1.1023 1.1041 1.1061 1.0901 1.0890 1.0958 1.0973
irintensity: 0.0065 0.0499 0.0543 0.0544 0.2550 3.5244 2.9368 4.0748 0.8796 0.3057 7.1311 0.4186 5.2882 0.7762 3.9432 1.0386 0.0138 4.6132 0.6017 6.3143 2.1165 0.1682 2.1333 0.2100 1.7185 0.0332 57.1473 1.2341 8.9564 3.7179 22.6082 20.7082 7.5709 3.8928 5.5825 0.7553 3.1483 51.9705 7.0409 8.5983 1.0236 9.8815 29.1980 3.5264 1.8047 47.8918 0.1267 7.5726 306.4879 8.5976 11.1031 12.4080 6.3094 31.8470 63.6483 10.2666 4.7445 1.1177 472.7938 20.4378 8.4488 7.6186 154.0368 21.4842 0.9127 0.9571 1.2539 1.3321 3.7264 85.0785 9.4115 62.9479 5.2868 14.3772 9.7904 6.1033 3.5882 12.5763 65.4453 8.9542 86.5900 37.8165 24.2077 27.9378 45.5382 21.2536 33.0372 15.6753 46.4735 16.8859 10.4955 45.2529 1.3078 1.0563 0.3486 0.5102
temp: 298.150 k
press: 1.00000 atm
elementType: 8 8 8 8 7 6 6 6 6 6 6 6 6 6 6 6 6 6 6 1 1 1 1 1 1 1 1 1 1 1 1 1 1 1
symmnumber: 1
zpe: 698877.7 jmol-1
zpe.correction: 0.266188 hartree
zpe.thermalcorrener: 0.282774 hartree
zpe.thermalcorrenthalpy: 0.283718 hartree
zpe.thermalcorrgfe: 0.219850 hartree
zpe.sumelectzpe: -896.653337 hartree
zpe.sumelectthermal: -896.636751 hartree
zpe.sumelectthermalent: -896.635807 hartree
zpe.sumelectthermalfe: -896.699676 hartree
dipole: -5.7353 -0.7879 0.0785
dipole: 5.7897
quadrupole: -134.6965 -112.3785 -108.5883
quadrupole: 8.9060 0.3598 0.0577
quadrupole: -16.1421 6.1759 9.9662 8.9060 0.3598 0.0577
hfenergy: -896.9195251 hartree
pointgroup: C01 [X(C14H15N1O4)]
dipole: -2.257535 -0.2822038 -0.1119471 debye
polarizability: 258.2681243|-0.6481131|151.3566622|-3.3239599|24.9837279|117.9099029 unknown
InChI: InChI=1S/C14H15NO4/c16-13(10-3-5-12(6-4-10)15(17)18)19-14-8-1-2-11(14)7-9-14/h3-6,11H,1-2,7-9H2
charge 0 multiplicity 1
34 atoms
O  -1.368363 -0.207524 -0.033432
O  -0.915961 1.848248 0.984128
O  5.939864 0.440251 0.096315
O  5.395026 -1.523777 -0.926896
N  5.081016 -0.42014 -0.336181
C  -2.838993 0.011632 0.128645
C  -3.668905 -1.291859 -0.162458
C  -3.344713 0.023281 1.607177
C  -4.320052 -1.159125 1.266149
C  -3.367772 1.101505 -0.831588
C  -4.57966 -0.964707 -1.365084
C  -4.759157 0.579551 -1.28885
C  -0.520685 0.787345 0.43978
C  0.922029 0.438118 0.223942
C  1.902715 1.358188 0.677522
C  1.315776 -0.766375 -0.415246
C  3.27053 1.083917 0.498679
C  2.680985 -1.053201 -0.602271
C  3.636508 -0.121279 -0.140718
H  -3.062601 -2.203325 -0.288152
H  -3.7982 0.970227 1.940041
H  -2.556773 -0.259567 2.32478
H  -4.223542 -2.048401 1.909093
H  -5.382872 -0.864639 1.230499
H  -2.688127 1.155061 -1.70418
H  -3.39806 2.097965 -0.361897
H  -5.540275 -1.509774 -1.32795
H  -4.073467 -1.238933 -2.311096
H  -5.07444 1.021744 -2.249949
H  -5.531927 0.839281 -0.540176
H  1.569442 2.279167 1.165739
H  0.547391 -1.46303 -0.758896
H  4.048478 1.772334 0.837964
H  3.017484 -1.970659 -1.091437
