program: Gaussian 09
title: 000026908
version: EM64L-G09RevD.01
frameworkgroup: C1[X(C19H30N2)]
method: RPBEPBE
basis: SDD
operation: Freq
keyword: #pfreq=noraman
keyword: PBEPBE/SDD
title: #p freq=noraman PBEPBE/SDD
converged: YES YES NO NO
title: Mulliken charges:
elementType: N N C C C C C C C C C C C C C C C C C C C H H H H H H H H H H H H H H H H H H H H H H H H H H H H H H
charge: -0.078225 -0.021632 0.258777 -0.077345 -0.485956 0.405191 -0.387782 0.133800 -0.729395 -0.744303 0.497062 -0.422441 -0.420935 -0.316620 -0.418987 -0.458249 -0.748096 -0.698702 -0.698991 -0.619584 -0.623112 0.208594 0.247767 0.210419 0.207068 0.238930 0.210906 0.234283 0.242290 0.242931 0.214909 0.227917 0.251692 0.222228 0.228259 0.246846 0.219014 0.215517 0.216293 0.208532 0.217838 0.221830 0.217500 0.208485 0.222282 0.232479 0.186699 0.219907 0.224657 0.221985 0.187466
chargesum: 0.00000
title: Mulliken charges with hydrogens summed into heavy atoms:
elementType: N N C C C C C C C C C C C C C C C C C C C
charge: -0.078225 -0.021632 0.258777 0.131250 -0.027769 0.405191 0.058216 0.133800 -0.041916 -0.058546 0.497062 -0.170748 -0.198707 -0.316620 -0.190728 -0.211404 -0.097273 -0.050502 -0.050725 0.019502 0.010996
polarizability: 2.56071028e+02 -1.41095171e+01 1.93158853e+02 9.51249360e-01 -6.14220589e+00 1.96556342e+02
1716.lowfreq: -10.0389 0.0004 0.0006 0.0009 2.7201 4.0016 20.2330 25.8925 31.8533
frequency: 20.0165 25.6894 31.7735 57.7511 61.7646 72.6772 86.4144 109.6080 116.0540 130.9589 136.2394 177.4427 191.9488 202.5548 209.9140 221.3047 231.4313 237.8034 246.2869 248.0629 261.6956 283.2358 290.5618 305.1505 316.1047 343.6243 351.0082 363.8452 374.2158 383.0906 406.6879 418.7750 440.5262 449.3836 456.6431 466.7989 478.2491 558.7532 565.3250 612.1368 637.2520 653.3918 719.5273 750.8397 781.8255 809.0756 832.8927 835.2977 851.6531 867.8891 905.5547 918.0311 921.3412 931.4468 942.9430 949.2336 957.7994 963.5278 978.7516 1004.3927 1018.4981 1019.5750 1025.6966 1033.2186 1037.2440 1058.4018 1082.2538 1093.9473 1109.1083 1120.8344 1132.0206 1137.4706 1145.9305 1173.7913 1177.8508 1205.2285 1209.5737 1214.0074 1216.9108 1253.0135 1263.8889 1272.6327 1285.2595 1306.6737 1311.1330 1314.6649 1323.6783 1359.0672 1375.6210 1376.8417 1378.2024 1385.0542 1401.5076 1404.0005 1405.6351 1419.9335 1443.3900 1459.3041 1459.8689 1464.0118 1465.1546 1467.6667 1467.9604 1472.6246 1473.4637 1477.0480 1478.3331 1480.6478 1484.4563 1485.9277 1487.9189 1494.4772 1495.5864 1505.6572 1572.3258 1619.8086 2178.4977 2843.6676 2854.9973 2873.9242 2971.7545 2973.2915 2978.5360 2980.2306 2981.2316 2984.4314 3002.4595 3019.6748 3019.9925 3027.0193 3066.7174 3068.3800 3069.7885 3070.3783 3074.6460 3076.8504 3077.0440 3078.7364 3079.2058 3082.6440 3083.2947 3087.8862 3091.1283 3118.9736 3122.6843 3144.9682 3156.3834
redmass: 3.0804 2.7650 3.3051 3.3973 3.4367 2.6476 4.2364 4.8828 2.5636 3.8562 4.6597 2.9994 1.2582 1.3865 1.8420 1.4066 1.1585 1.4854 1.1038 1.6143 1.8072 2.6812 2.5969 1.0538 2.5472 2.4852 2.3437 3.0725 3.1258 2.7441 2.8553 2.6435 2.7016 3.3687 3.0877 3.3203 3.8680 3.7252 2.6436 3.1240 7.1647 4.2048 4.9950 3.2513 1.4049 4.0830 1.9877 2.3147 1.3435 2.3988 2.2048 1.7504 1.1768 1.6421 1.2200 1.9020 1.4400 1.6749 1.3945 3.4111 2.8853 1.5028 1.3837 1.8773 1.9833 1.8085 1.9770 1.5897 2.6475 1.6646 1.4263 2.1985 1.7655 2.1766 2.0471 2.9662 1.3655 2.1160 2.2811 1.8194 2.2159 3.0764 1.3781 1.3361 1.3503 1.3024 1.3797 4.9012 1.2372 1.1952 1.3382 1.2306 1.2153 1.2041 2.9590 1.1422 1.1642 1.0509 1.0726 1.0512 1.0483 1.0533 1.0646 1.0531 1.0490 1.0596 1.0714 1.0656 1.0530 1.0516 1.0651 1.0568 1.1136 2.0030 6.7123 6.2072 12.6459 1.0574 1.0597 1.0663 1.0349 1.0350 1.0359 1.0812 1.0384 1.0364 1.0634 1.0750 1.0825 1.0719 1.1002 1.0999 1.1004 1.0998 1.1009 1.0986 1.0992 1.0996 1.1008 1.0988 1.1004 1.0992 1.0984 1.0878 1.0869 1.0952 1.0941
irintensity: 0.1391 0.3279 0.1386 0.1320 0.1575 0.1675 2.9428 1.9007 0.9696 1.2145 1.9056 0.1175 0.0688 0.5680 0.3442 0.2506 0.5940 0.2851 0.0030 0.1377 1.5008 0.7328 1.4466 0.0213 0.0945 5.6241 2.9171 0.3192 0.2073 1.1165 0.0438 0.4298 0.1412 0.3257 0.6377 0.2513 1.8771 0.9065 19.1814 1.5192 0.0981 12.5796 1.0397 0.3731 5.5655 14.6103 31.4100 10.1573 1.5240 10.4104 4.8432 3.0976 5.5631 2.2907 0.5338 2.5207 1.3677 3.0630 0.1740 15.8563 0.9023 4.7843 0.0912 35.4677 17.4983 2.9838 6.6061 7.7818 17.4042 19.1875 7.5908 0.5086 21.2323 1.2919 10.5236 6.1597 1.4230 7.1893 2.2969 7.1096 8.1875 33.6424 0.3840 1.0604 11.9612 0.2200 1.7406 5.7941 20.9004 19.9304 3.0656 18.2479 25.1925 10.1070 7.7712 3.4461 1.7753 0.0935 9.3084 18.9749 0.5538 0.9917 1.2823 4.7819 0.7358 14.6618 15.7805 12.8639 16.7255 11.8875 17.2811 14.1805 6.0272 57.5383 0.0173 0.1947 7.9517 65.7040 103.2804 148.1474 31.2801 31.0885 33.8852 14.7765 22.9083 28.4657 8.3087 47.1336 16.8315 48.7145 3.7050 3.4996 22.6511 1.6323 33.2151 123.6755 29.5295 30.4206 49.5091 52.0326 49.8780 35.0073 28.7930 17.1851 13.6268 14.4398 9.2905
temp: 298.150 k
press: 1.00000 atm
elementType: 7 7 6 6 6 6 6 6 6 6 6 6 6 6 6 6 6 6 6 6 6 1 1 1 1 1 1 1 1 1 1 1 1 1 1 1 1 1 1 1 1 1 1 1 1 1 1 1 1 1 1
symmnumber: 1
zpe: 1167540.9 jmol-1
zpe.correction: 0.444693 hartree
zpe.thermalcorrener: 0.469297 hartree
zpe.thermalcorrenthalpy: 0.470241 hartree
zpe.thermalcorrgfe: 0.390254 hartree
zpe.sumelectzpe: -849.858700 hartree
zpe.sumelectthermal: -849.834096 hartree
zpe.sumelectthermalent: -849.833152 hartree
zpe.sumelectthermalfe: -849.913139 hartree
dipole: -2.6244 1.5590 -3.4550
dipole: 4.6103
quadrupole: -131.4830 -128.9550 -133.9911
quadrupole: 2.3742 -9.7232 5.9005
quadrupole: -0.0067 2.5214 -2.5147 2.3742 -9.7232 5.9005
hfenergy: -850.3033928 hartree
pointgroup: C01[X(C19H30N2)]
dipole: -1.0803355 0.5856422 -1.3341482 debye
polarizability: 257.0267695|-11.9282283|192.3122668|-0.1007063|-5.902483|196.4471867 unknown
InChI: InChI=1S/C19H30N2/c1-15(2)19(14-20,12-13-21(6)7)17-10-8-16(9-11-17)18(3,4)5/h8-11,15H,12-13H2,1-7H3
charge 0 multiplicity 1
51 atoms
N  3.156375 2.670928 -0.148487
N  2.510556 -1.576252 2.360257
C  1.595007 -0.925086 -0.069316
C  1.826189 -2.185063 -1.019592
C  2.430791 0.308329 -0.574056
C  0.085275 -0.5750 -0.025855
C  2.226376 1.589183 0.261516
C  -4.238784 0.408454 0.001893
C  1.014354 -3.413218 -0.5465
C  3.318531 -2.557078 -1.182205
C  -2.729058 0.07155 -0.033874
C  -0.689048 -0.662685 1.156353
C  -0.569406 -0.157387 -1.210572
C  2.085294 -1.280216 1.285142
C  -2.063288 -0.346198 1.149298
C  -1.945552 0.158204 -1.213219
C  -4.782454 0.831936 -1.38667
C  -4.481914 1.579831 1.00141
C  -5.036045 -0.84444 0.476101
C  3.272563 3.71915 0.887087
C  2.829512 3.247906 -1.468719
H  1.435408 -1.872274 -2.009873
H  3.506825 0.065174 -0.548632
H  2.155655 0.481134 -1.631699
H  1.158269 1.917916 0.2077
H  2.439449 1.352518 1.321532
H  1.122219 -4.23949 -1.272412
H  1.380439 -3.775655 0.432354
H  -0.060032 -3.181589 -0.447328
H  3.781507 -2.783215 -0.203643
H  3.407989 -3.461878 -1.810749
H  3.905605 -1.757914 -1.66606
H  -0.21615 -0.981264 2.092205
H  -0.008189 -0.069332 -2.148814
H  -2.621345 -0.429059 2.089306
H  -2.406449 0.476424 -2.153145
H  -5.862652 1.053152 -1.308907
H  -4.280969 1.742774 -1.763065
H  -4.658779 0.029195 -2.137068
H  -5.56079 1.819419 1.053616
H  -4.141969 1.323357 2.020684
H  -3.939654 2.488783 0.682559
H  -4.714656 -1.178505 1.478616
H  -6.116595 -0.612332 0.526364
H  -4.894907 -1.688906 -0.223194
H  3.597879 3.265546 1.839888
H  2.31568 4.270728 1.074161
H  4.035843 4.457786 0.582329
H  2.872544 2.471884 -2.252145
H  3.574605 4.021855 -1.725754
H  1.813043 3.719322 -1.502318
