program: Gaussian 09
title: 000297137
version: EM64L-G09RevD.01
frameworkgroup: C1[X(C6H11FO5)]
method: RPBEPBE
basis: SDD
operation: Freq
keyword: #p
keyword: freq=noraman
keyword: PBEPBE/SDD
title: #p freq=noraman PBEPBE/SDD
converged: NO YES NO NO
title: Mulliken charges:
elementType: F O O O O O C C C C C C H H H H H H H H H H H
charge: -0.210670 -0.286638 -0.426327 -0.439325 -0.426197 -0.445657 -0.183859 0.207659 -0.036083 -0.105340 -0.342704 -0.402220 0.242423 0.244573 0.208841 0.261376 0.209906 0.260822 0.217171 0.371438 0.371782 0.343362 0.365668
chargesum: 0.00000
title: Mulliken charges with hydrogens summed into heavy atoms:
elementType: F O O O O O C C C C C C
charge: -0.210670 -0.286638 -0.054890 -0.067543 -0.082835 -0.079989 0.058565 0.207659 0.208490 0.103501 0.128577 0.075773
polarizability: 9.04838183e+01 4.89991097e+00 8.02256655e+01 5.22841232e-01 1.03946364e-01 6.95021997e+01
1716.lowfreq: -10.7890 -0.0002 -0.0001 0.0011 8.3323 12.7323 82.0345 96.4183 121.7234
frequency: 81.9688 96.3450 121.7061 176.3025 207.3867 223.5253 238.8999 245.0238 260.9038 306.9846 317.1840 328.6747 380.5331 432.3953 460.0236 476.4282 505.3044 566.9135 573.5169 611.2976 672.5417 720.2733 755.3780 837.3465 857.4828 907.2134 954.1206 972.6320 982.7246 1004.1182 1023.7558 1038.9650 1049.3343 1097.5752 1106.7099 1153.2346 1181.4910 1201.5200 1212.7704 1242.9818 1277.6789 1287.1618 1298.4724 1316.2099 1329.9219 1355.7178 1360.0651 1380.8822 1389.4570 1402.6524 1454.9298 1463.5122 2946.2315 3019.0153 3028.8109 3040.7028 3067.3922 3103.3594 3121.6038 3423.2589 3524.5023 3546.3019 3565.6026
redmass: 6.4687 4.3650 7.4978 4.2606 5.8639 3.5215 5.4173 1.8089 1.6276 5.0834 5.1380 3.6582 5.2940 1.6838 1.4747 2.1315 2.9685 4.1798 4.5415 3.0575 1.2805 3.5307 4.8910 2.9255 3.7464 3.2628 4.8631 3.9956 6.3481 2.4403 2.0489 2.3573 2.8474 2.0857 2.8966 4.7884 1.2346 1.2424 1.1947 1.3292 1.4852 1.2694 1.2295 1.2462 1.2966 1.3246 1.2739 1.2111 1.6624 1.6101 1.0764 1.0905 1.0827 1.0641 1.0575 1.0842 1.0879 1.1096 1.1020 1.0640 1.0647 1.0655 1.0665
irintensity: 2.8425 6.4981 2.0728 9.0967 8.1348 22.8526 6.6619 83.4622 48.8038 7.1305 14.7359 5.5247 20.6029 102.8174 132.6761 23.1969 23.3728 53.5316 8.7548 32.5576 153.6778 29.5960 33.4773 54.2764 7.2039 19.9967 105.4432 1.7795 246.3252 36.5843 1.2710 55.1197 99.9074 9.4605 18.7962 31.6079 27.7542 2.2148 28.1073 42.5705 4.9154 11.1410 2.0616 27.0091 19.4906 26.3605 1.6649 38.2198 46.6967 1.1674 7.9000 10.4886 39.1305 23.8839 37.1534 18.4129 26.5065 13.2135 6.9810 61.9901 26.6689 13.3399 8.1124
temp: 298.150 k
press: 1.00000 atm
elementType: 9 8 8 8 8 8 6 6 6 6 6 6 1 1 1 1 1 1 1 1 1 1 1
symmnumber: 1
zpe: 468259.8 jmol-1
zpe.correction: 0.178351 hartree
zpe.thermalcorrener: 0.190563 hartree
zpe.thermalcorrenthalpy: 0.191507 hartree
zpe.thermalcorrgfe: 0.141044 hartree
zpe.sumelectzpe: -710.186293 hartree
zpe.sumelectthermal: -710.174081 hartree
zpe.sumelectthermalent: -710.173137 hartree
zpe.sumelectthermalfe: -710.223600 hartree
dipole: -0.0928 -3.9416 -2.3762
dipole: 4.6034
quadrupole: -76.4327 -67.8622 -68.4902
quadrupole: 5.7573 4.9006 0.4822
quadrupole: -5.5044 3.0662 2.4382 5.7573 4.9006 0.4822
hfenergy: -710.364644 hartree
pointgroup: C01 [X(C6H11F1O5)]
dipole: -0.0388091 -1.5663783 -0.9083441 debye
dipolederiv: -0.339184 0.0191738 0.065421 0.0287851 -0.3739605 -0.1188577 0.1182736 -0.1697555 -0.5591128 -0.9586108 -0.1962391 -0.0261417 -0.2939025 -0.7549363 -0.0204299 0.0252129 0.0842463 -0.4659688 -0.6410114 -0.0098082 -0.0547766 -0.0778004 -0.8058595 -0.0625563 -0.0772447 -0.0983696 -0.213472 -0.5044989 -0.0818549 -0.0318846 -0.1894077 -0.5471166 -0.0305194 -0.2281239 -0.1451276 -0.7972218 -0.95304 -0.1374616 -0.0107416 -0.065272 -0.1861041 0.1536884 -0.0037118 0.1530583 -0.4990615 -0.7305904 0.291648 0.0435393 0.3451466 -0.3749743 0.0964533 0.0496888 0.0806776 -0.5393736 0.2433168 0.1292178 0.0390787 0.048201 0.5018198 0.0703051 0.0345855 0.0301386 0.2117669 0.5700619 0.2222446 0.1045732 0.3863826 0.7182044 0.0879707 0.3293699 0.1477657 0.6421556 0.2674901 -0.0909723 -0.0435111 -0.0951488 0.3166275 0.1068286 -0.0878458 0.1430116 0.5899304 0.6957596 0.1009166 -0.0425451 0.1601708 0.1348288 -0.0778416 -0.028547 0.0298777 0.3203597 0.4919285 0.1203243 -0.0340313 0.0594538 0.2407902 -0.001129 -0.1089522 -0.0857825 0.2301935 0.3480488 -0.1777502 0.0983366 -0.1700691 0.287061 -0.1219915 0.0176055 -0.0571755 0.2804746 0.0613812 -0.0081658 0.0269052 -0.008077 0.0454493 -0.0363385 -0.0041894 -0.0471572 -0.0950717 -0.0142213 0.0816296 -0.0586575 0.0830021 -0.0147647 0.0592794 -0.0255197 0.0138256 -0.0245203 -0.0247086 -0.0045786 0.0443056 0.0125032 0.0245585 -0.050231 0.0518405 -0.0246836 -0.1810719 0.022954 -0.0170825 0.0007818 0.0327381 0.0995712 -0.059112 0.0325002 0.0204053 -0.0616709 -0.0002226 -0.0573684 0.0088178 -0.0681283 -0.1442089 0.0126783 -0.0036151 -0.0259221 0.0918586 0.0482423 -0.0533639 -0.0056763 -0.0501072 -0.0336594 0.0459389 -0.0317051 0.0025423 0.0866754 0.0469765 0.0295106 -0.0586422 0.0385504 0.0400991 -0.0803853 -0.0431085 -0.0350873 -0.1342209 0.3822095 -0.0385453 0.0388637 -0.0423952 0.3845086 0.0606261 0.040648 0.035133 0.11568 0.2935977 0.0333188 -0.0880265 0.0732956 0.2817038 0.0476069 -0.0321599 0.0307081 0.3664063 0.3335965 0.0053558 0.03985 -0.0604816 0.0142938 -0.0774362 0.0450065 -0.0740789 0.3428014 0.3605245 -0.1601489 -0.0558382 -0.1474396 0.1460681 -0.0045471 -0.0700082 -0.0082502 0.2924636 unknown
polarizability: 90.3955091|5.0056185|80.3237502|0.0348143|-0.1678445|69.4924241 unknown
InChI: InChI=1S/C6H11FO5/c7-4-3(9)1-12-6(11,2-8)5(4)10/h3-5,8-11H,1-2H2
charge 0 multiplicity 1
23 atoms
F  -1.503594 1.246923 0.98924
O  0.581594 -1.362974 -0.264213
O  0.554044 2.400555 -0.510885
O  1.250529 0.389811 1.256782
O  -3.137331 -0.778264 -0.084933
O  3.39266 -0.808261 0.07079
C  0.134714 1.038135 -0.797061
C  1.100703 0.017747 -0.132545
C  -1.344858 0.811992 -0.403227
C  -1.745298 -0.661655 -0.517789
C  -0.770656 -1.519427 0.317261
C  2.484111 -0.046949 -0.804842
H  0.220338 0.928974 -1.893607
H  -2.010053 1.465443 -0.993906
H  -1.630385 -0.955181 -1.586104
H  -0.776474 -1.198215 1.374094
H  -0.994985 -2.595999 0.239251
H  2.914057 0.963182 -0.878224
H  2.405401 -0.508053 -1.806618
H  0.54343 2.493211 0.479415
H  2.135851 0.024627 1.544419
H  -3.452333 -1.704054 -0.242713
H  3.087636 -1.753066 0.068917
