program: Gaussian 09
title: 000026892
version: EM64L-G09RevD.01
frameworkgroup: C1[X(C18H28N2)]
method: RPBEPBE
basis: SDD
operation: Freq
keyword: #pfreq=noraman
keyword: PBEPBE/SDD
title: #p freq=noraman PBEPBE/SDD
converged: YES YES NO NO
title: Mulliken charges:
elementType: N N C C C C C C C C C C C C C C C C C C H H H H H H H H H H H H H H H H H H H H H H H H H H H H
charge: -0.080171 -0.021701 0.262536 -0.076877 -0.482904 0.391745 -0.388640 -0.743925 -0.728794 -0.317302 -0.395300 -0.387929 0.506780 -0.447319 -0.432873 -0.537956 -0.620284 -0.620176 -0.358980 -0.684564 0.207791 0.247821 0.209056 0.208293 0.237520 0.242591 0.215218 0.227426 0.211032 0.234552 0.242116 0.221730 0.252633 0.231959 0.233584 0.200984 0.203596 0.220768 0.222339 0.188814 0.232613 0.187255 0.219657 0.212470 0.209765 0.210154 0.211588 0.221309
chargesum: 0.00000
title: Mulliken charges with hydrogens summed into heavy atoms:
elementType: N N C C C C C C C C C C C C C C C C C C
charge: -0.080171 -0.021701 0.262536 0.130914 -0.026027 0.391745 0.057172 -0.058689 -0.041094 -0.317302 -0.173570 -0.135296 0.506780 -0.215360 -0.199289 -0.133376 0.011638 0.019349 0.063255 -0.041513
polarizability: 2.48313128e+02 -8.86496820e+00 1.80435192e+02 3.52103609e+00 -6.00125958e+00 1.85609681e+02
1716.lowfreq: -9.0214 -6.9934 -0.0007 -0.0004 0.0003 3.3307 24.5100 27.0529 30.3184
frequency: 24.2602 26.6337 30.0864 45.9995 50.4946 66.0589 77.0285 82.5643 104.1859 117.2314 126.6664 138.4254 193.5737 203.9560 209.7204 217.9019 221.3878 229.1059 231.0709 247.2216 274.2293 282.0622 315.5704 342.1922 350.5551 362.3222 383.0324 406.0675 411.0818 418.5897 446.2952 459.1397 478.4664 546.1421 609.6078 610.8015 637.2864 673.4393 741.7417 744.9351 779.3442 806.9875 811.0246 834.9338 852.5115 866.5992 868.8715 893.4371 903.8178 919.5614 949.5331 957.1834 964.5456 979.2870 1006.9141 1018.6427 1032.2280 1037.1591 1049.0086 1056.1203 1061.7032 1083.5720 1093.0040 1094.1642 1121.7570 1132.1808 1134.4162 1143.7565 1170.8895 1176.7128 1200.2166 1214.4069 1221.6005 1223.4151 1257.3554 1264.6387 1281.8427 1282.7409 1283.5973 1304.1167 1314.6592 1318.1838 1320.7044 1338.4371 1372.5829 1377.5217 1383.5651 1390.6078 1401.7395 1407.9844 1419.1031 1442.4459 1460.2883 1462.7416 1467.6405 1469.7352 1471.1818 1471.9871 1476.2552 1476.7042 1477.3665 1480.6106 1484.8686 1487.0937 1489.0091 1493.0045 1503.0557 1578.4971 1621.6941 2178.5311 2845.7265 2856.9092 2877.1189 2972.3884 2974.5083 2980.6740 2982.4802 2983.5209 2983.8181 3000.8765 3016.7804 3019.6178 3022.5156 3026.5700 3042.7382 3070.6015 3071.9241 3074.4175 3076.0763 3077.5655 3079.9323 3082.9443 3087.1337 3089.9154 3110.5711 3118.5467 3134.4229 3144.8742
redmass: 3.6809 2.5387 2.7141 3.5602 2.7488 3.1817 1.8325 4.0278 3.1890 2.9509 5.8767 4.2003 1.8293 2.3419 1.5207 1.4546 1.3124 1.5103 1.1659 1.4352 2.3407 2.8251 2.7425 2.9280 2.6501 2.8858 3.3384 2.8542 2.4760 3.6861 2.4942 3.7149 4.7651 2.8923 4.2492 3.5551 6.9055 4.0282 3.7033 1.1157 1.4995 2.6260 3.4631 2.1976 1.3314 1.7862 1.5519 1.8899 2.1908 1.1698 1.9126 1.4816 1.6688 1.3927 3.5732 2.9043 1.6994 2.2191 2.9040 1.8239 1.4332 2.0470 1.5588 2.1425 1.7007 1.4902 1.8899 1.7211 2.3327 2.0177 1.1329 3.1079 1.4060 2.1134 2.0136 1.9224 1.2985 1.2305 1.3452 1.3962 1.3290 1.2904 1.3236 1.4679 3.3525 1.5198 1.2310 1.2135 1.2110 2.8903 1.1424 1.1650 1.0646 1.0564 1.0540 1.0797 1.0556 1.0440 1.0514 1.0609 1.0442 1.0799 1.0519 1.0611 1.0899 1.0484 2.5039 6.7087 6.3695 12.6454 1.0573 1.0590 1.0667 1.0482 1.0463 1.0375 1.0814 1.0591 1.0379 1.0646 1.0999 1.0726 1.0854 1.0725 1.1034 1.0997 1.1013 1.0992 1.0997 1.1000 1.1003 1.1005 1.0991 1.0986 1.0864 1.0882 1.0957 1.0959
irintensity: 0.0947 0.4427 0.1703 0.0715 0.0556 0.1125 0.1169 3.2940 0.2220 1.4846 2.2238 1.4546 0.1807 0.3194 0.6900 0.6965 0.0526 0.3202 0.0439 0.5195 0.9458 2.4971 0.1050 2.4818 6.3290 0.4360 0.2251 0.0505 0.5784 1.2361 0.3631 0.5773 1.7738 18.7327 0.6105 1.1098 0.0254 16.1644 1.1262 4.6274 8.3181 11.4208 8.9477 32.9443 0.7976 6.5263 6.5009 0.6798 4.7223 5.1626 3.2692 2.2347 2.3956 0.1223 12.5154 1.2137 29.3272 23.6487 0.4033 2.8197 1.4833 6.1946 6.6446 22.0825 20.1726 6.1415 1.9880 17.2906 0.7135 11.3286 1.7901 8.9840 0.2728 0.3686 4.3126 8.4053 1.0637 0.6381 0.3097 0.1830 12.8272 0.6016 2.9015 1.7330 3.4572 2.5057 20.8077 10.0698 22.2504 4.9178 3.5903 2.1196 5.1066 19.3751 0.9689 0.1720 6.9441 3.4550 17.5265 2.2007 11.6091 12.7215 14.6300 14.2698 17.1864 14.6672 40.9283 0.5218 0.6070 8.0404 64.8586 111.1555 136.9868 8.5018 50.0652 21.1388 13.1483 60.9984 31.2322 9.4069 0.5639 42.7851 23.7098 43.3216 12.9254 1.1537 71.7844 43.6082 47.0842 6.9129 62.1775 47.2865 44.2905 25.7713 14.6587 17.2382 24.3794 2.4528
temp: 298.150 k
press: 1.00000 atm
elementType: 7 7 6 6 6 6 6 6 6 6 6 6 6 6 6 6 6 6 6 6 1 1 1 1 1 1 1 1 1 1 1 1 1 1 1 1 1 1 1 1 1 1 1 1 1 1 1 1
symmnumber: 1
zpe: 1096460.6 jmol-1
zpe.correction: 0.417620 hartree
zpe.thermalcorrener: 0.441051 hartree
zpe.thermalcorrenthalpy: 0.441995 hartree
zpe.thermalcorrgfe: 0.363112 hartree
zpe.sumelectzpe: -810.636702 hartree
zpe.sumelectthermal: -810.613270 hartree
zpe.sumelectthermalent: -810.612326 hartree
zpe.sumelectthermalfe: -810.691209 hartree
dipole: -2.8005 1.1373 -3.3546
dipole: 4.5155
quadrupole: -125.1183 -122.0097 -126.9960
quadrupole: 0.9825 -9.5448 4.6120
quadrupole: -0.4103 2.6983 -2.2880 0.9825 -9.5448 4.6120
hfenergy: -811.0543215 hartree
pointgroup: C01 [X(C18H28N2)]
dipole: -1.1166893 0.4426967 -1.3088678 debye
polarizability: 248.4475597|-8.6506067|180.3620553|2.9218397|-5.8999135|185.5483863 unknown
InChI: InChI=1S/C18H28N2/c1-6-7-16-8-10-17(11-9-16)18(14-19,15(2)3)12-13-20(4)5/h8-11,15H,6-7,12-13H2,1-5H3
charge 0 multiplicity 1
48 atoms
N  2.390862 3.035555 -0.181191
N  2.57089 -1.253756 2.405027
C  1.586117 -0.801842 -0.042614
C  2.066155 -2.000597 -0.978725
C  2.178399 0.565965 -0.546092
C  0.036799 -0.740622 -0.025451
C  1.753225 1.784487 0.30013
C  3.604051 -2.080512 -1.12299
C  1.501558 -3.358704 -0.499649
C  2.113065 -1.050564 1.32178
C  -0.658396 -0.472438 -1.233549
C  -0.727253 -0.952956 1.14703
C  -2.836569 -0.625416 -0.089693
C  -2.066497 -0.416298 -1.263484
C  -2.138588 -0.895826 1.112908
C  -4.353069 -0.516584 -0.116643
C  1.802317 3.537703 -1.439802
C  2.418327 4.083601 0.860566
C  -4.852618 0.944099 0.07536
C  -6.391757 1.049094 0.043863
H  1.633674 -1.777562 -1.975673
H  3.280584 0.522838 -0.536824
H  1.863403 0.693803 -1.599199
H  0.637999 1.868777 0.32243
H  2.085322 1.618425 1.342506
H  4.090492 -2.199209 -0.13689
H  3.873004 -2.960184 -1.735819
H  4.032499 -1.190652 -1.615063
H  1.776193 -4.155194 -1.214757
H  1.919869 -3.633005 0.486694
H  0.401598 -3.339368 -0.413598
H  -0.10149 -0.305704 -2.163371
H  -0.219597 -1.16815 2.094075
H  -2.578176 -0.212069 -2.212467
H  -2.705403 -1.068646 2.036223
H  -4.745685 -0.898054 -1.080298
H  -4.793585 -1.147613 0.680121
H  1.893968 2.782229 -2.23913
H  2.350249 4.438853 -1.768307
H  0.718766 3.806071 -1.340589
H  2.940388 3.703726 1.756323
H  1.400243 4.43054 1.172998
H  2.975773 4.961695 0.487277
H  -4.466866 1.33332 1.038146
H  -4.413688 1.582857 -0.716394
H  -6.796174 0.695892 -0.923602
H  -6.848488 0.434433 0.842439
H  -6.725589 2.092762 0.18857
