program: Gaussian 09
title: 000297160
version: EM64L-G09RevD.01
frameworkgroup: C1[X(C17H14O4)]
method: RPBEPBE
basis: SDD
operation: Freq
keyword: #pfreq=noraman
keyword: PBEPBE/SDD
title: #p freq=noraman PBEPBE/SDD
converged: NO YES NO NO
title: Mulliken charges:
elementType: O O O O C C C C C C C C C C C C C C C C C H H H H H H H H H H H H H H
charge: -0.190571 -0.174740 -0.154854 -0.262561 -0.286491 -0.279839 -0.404258 -0.437806 0.479790 -0.217594 -0.213822 0.184684 0.176718 -0.537495 0.451993 -0.385722 -0.371107 -0.372263 -0.385576 0.316731 -0.538097 0.300111 0.298924 0.296625 0.294791 0.254679 0.255356 0.233692 0.233969 0.244784 0.251484 0.245100 0.246165 0.225155 0.222044
chargesum: 0.00000
title: Mulliken charges with hydrogens summed into heavy atoms:
elementType: O O O O C C C C C C C C C C C C C C C C C
charge: -0.190571 -0.174740 -0.154854 -0.262561 0.013620 0.019085 -0.107632 -0.143015 0.479790 0.037085 0.041535 0.184684 0.176718 -0.303802 0.451993 -0.151754 -0.126323 -0.120780 -0.140476 0.316731 0.155267
polarizability: 2.74398043e+02 2.52382163e+01 1.60435111e+02 -2.80252715e+00 -1.83879875e+01 1.53065729e+02
1716.lowfreq: -8.4070 0.0006 0.0006 0.0008 2.7675 5.4051 30.3870 37.0635 47.4809
frequency: 30.2694 37.0483 47.4764 60.4429 101.5400 110.3904 132.2601 166.9355 194.4988 210.0361 227.3061 245.0101 261.5683 297.3716 324.5077 395.9525 398.7087 416.7385 421.2203 464.7107 493.7238 527.7756 534.7843 572.1106 589.9072 607.6106 626.2402 647.5014 664.0821 698.2882 728.2141 734.4357 747.1875 766.1102 800.9567 814.5045 816.6262 822.1501 830.4037 839.9455 861.5163 888.2857 896.5018 915.9988 925.5643 947.0959 950.8254 964.3352 967.3321 986.4988 1000.4503 1001.1064 1041.0016 1078.3997 1091.2311 1099.3454 1111.9561 1121.1293 1129.9787 1145.5656 1157.7416 1182.9255 1199.6084 1212.1267 1223.8068 1234.8929 1238.9808 1254.1941 1263.7977 1270.9143 1290.6783 1310.3289 1340.9752 1385.3671 1425.4764 1437.6171 1468.1110 1472.7057 1503.8474 1573.4215 1575.9402 1621.3102 1693.4609 1710.1620 1762.7671 2962.2924 3051.2871 3066.6984 3078.2516 3079.7426 3112.8435 3126.8819 3127.1895 3132.5707 3150.8769 3167.5098 3169.8846 3171.8049 3201.1793
redmass: 7.0273 3.9038 10.4163 5.1326 5.1752 4.0315 14.9163 4.1109 5.0984 3.8511 1.6370 3.8549 2.7499 3.6902 5.7001 6.0625 4.1637 2.9789 4.3546 3.9863 4.8346 2.8300 4.1736 11.8055 6.8250 4.8857 6.3666 7.8895 2.3045 4.4698 3.8596 3.9507 3.5573 5.2333 6.4745 4.6200 1.5521 3.2374 2.5508 2.4579 3.0570 2.4948 1.9402 2.3932 1.5022 1.6010 1.7926 1.8112 1.9090 8.2289 2.0189 2.6322 3.6829 1.2664 2.2746 1.5272 1.2604 1.4860 5.1959 1.3450 1.3350 1.3015 1.4455 1.3190 1.6127 1.8429 1.9910 1.6620 1.7565 1.4774 1.7058 1.3805 2.3610 2.5706 3.4560 1.1769 1.0497 1.0744 2.5092 6.7841 5.8073 6.2691 12.9768 9.4215 12.8259 1.0328 1.1040 1.0854 1.0875 1.0882 1.0909 1.0990 1.0900 1.0913 1.0871 1.0950 1.0879 1.0960 1.1101
irintensity: 1.4659 2.0236 1.0453 1.0299 0.7949 5.1926 2.7957 2.0440 3.5581 3.1138 0.4014 2.3669 1.0010 1.5650 6.6856 2.5693 0.7101 0.9970 2.3081 1.5643 3.2027 21.3418 22.2147 4.2113 12.8619 34.4493 5.5612 6.9150 8.2631 9.1377 4.9004 9.1077 27.0645 4.6171 82.3548 34.1572 19.8776 104.1550 59.3992 52.1418 20.2872 20.5162 21.1061 15.2069 0.9120 3.4517 0.9102 3.0670 8.4449 46.4635 14.5992 6.8368 82.3804 0.9776 0.6661 8.4484 0.2159 14.3207 157.0048 0.1541 1.3610 103.1292 0.7641 0.7062 4.5877 90.0350 88.6751 31.6306 1.7320 0.3674 2.3045 2.7713 25.0842 5.3107 3.1423 12.3720 13.8745 59.2260 105.4688 16.2133 1.7610 111.4133 448.7367 4.4867 117.6094 68.2841 45.8992 2.4873 15.1807 10.9930 11.2748 29.8792 9.8812 3.7400 7.7290 12.1695 1.9028 3.7714 17.3236
temp: 298.150 k
press: 1.00000 atm
elementType: 8 8 8 8 6 6 6 6 6 6 6 6 6 6 6 6 6 6 6 6 6 1 1 1 1 1 1 1 1 1 1 1 1 1 1
symmnumber: 1
zpe: 699461.5 jmol-1
zpe.correction: 0.266411 hartree
zpe.thermalcorrener: 0.283713 hartree
zpe.thermalcorrenthalpy: 0.284657 hartree
zpe.thermalcorrgfe: 0.220105 hartree
zpe.sumelectzpe: -955.565751 hartree
zpe.sumelectthermal: -955.548449 hartree
zpe.sumelectthermalent: -955.547505 hartree
zpe.sumelectthermalfe: -955.612057 hartree
dipole: -0.1135 -2.7478 -4.3334
dipole: 5.1324
quadrupole: -106.2604 -125.5233 -123.8063
quadrupole: 16.0196 8.7645 -7.7324
quadrupole: 12.2696 -6.9933 -5.2763 16.0196 8.7645 -7.7324
hfenergy: -955.8321618 hartree
pointgroup: C01 [X(C17H14O4)]
dipole: 0.0429741 -1.2206258 1.6079736 debye
polarizability: 273.9046598|-25.8146309|157.7465167|-5.3957558|18.9290417|156.2477064 unknown
InChI: InChI=1S/C17H14O4/c1-20-10-4-2-9(3-5-10)8-13-11-6-7-12(13)15-14(11)16(18)21-17(15)19/h2-8,11-12,14-15H,1H3
charge 0 multiplicity 1
35 atoms
O  2.311912 2.060443 -0.906455
O  1.091306 2.675718 0.984729
O  3.689709 0.928034 -2.4161
O  -5.462473 0.160145 -0.18344
C  2.479379 0.601226 1.028437
C  3.33256 -0.003863 -0.126075
C  1.367627 -0.516615 1.290355
C  2.609327 -1.401079 -0.418218
C  1.14975 -1.000002 -0.153516
C  2.141305 -1.721673 1.851443
C  2.880273 -2.251285 0.832641
C  1.870019 1.877827 0.454667
C  3.191782 0.972171 -1.290218
C  0.066755 -1.126083 -0.962263
C  -1.336709 -0.7368 -0.708068
C  -2.375127 -1.445355 -1.383111
C  -1.719608 0.333214 0.145949
C  -3.728968 -1.13344 -1.185732
C  -3.075287 0.664622 0.350751
C  -4.087111 -0.077585 -0.309182
C  -5.883666 1.255644 0.69428
H  3.033992 0.835939 1.95052
H  4.399574 -0.151035 0.103233
H  0.510728 -0.164643 1.876252
H  2.865333 -1.835057 -1.393985
H  2.120238 -2.03313 2.89817
H  3.5882 -3.08181 0.877714
H  0.243358 -1.608349 -1.936186
H  -2.109557 -2.261829 -2.065636
H  -0.957467 0.957656 0.622024
H  -4.524024 -1.682217 -1.699243
H  -3.325036 1.508369 1.000768
H  -6.982254 1.25637 0.644427
H  -5.493006 2.22858 0.338506
H  -5.557036 1.082894 1.738162
