program: Gaussian 09
title: 000297122
version: EM64L-G09RevD.01
frameworkgroup: C1[X(C7H5NO5)]
method: RPBEPBE
basis: SDD
operation: Freq
keyword: #pfreq=noraman
keyword: PBEPBE/SDD
title: #p freq=noraman PBEPBE/SDD
converged: NO NO NO NO
title: Mulliken charges:
elementType: O O O O O N C C C C C C C H H H H H
charge: -0.253448 -0.241771 -0.375922 -0.197618 -0.283203 0.023425 0.245009 0.227420 -0.486045 0.327614 -0.428640 0.172709 -0.201270 0.308735 0.291096 0.251880 0.251890 0.368141
chargesum: 0.00000
title: Mulliken charges with hydrogens summed into heavy atoms:
elementType: O O O O O N C C C C C C C
charge: -0.253448 -0.241771 -0.007781 -0.197618 -0.283203 0.023425 0.245009 0.227420 -0.177311 0.327614 -0.137544 0.172709 0.302499
polarizability: 1.82423593e+02 6.11580711e+00 1.11882874e+02 -2.29111842e-03 7.73665018e-03 4.25512289e+01
1716.lowfreq: -7.9258 -5.6145 -0.0005 -0.0005 0.0003 6.6632 44.5263 94.0404 115.1641
frequency: 44.3780 94.0332 115.1617 166.2960 225.8699 259.4171 347.7854 355.7907 357.4219 407.8393 416.5736 469.9190 576.5099 613.1771 672.7630 684.1003 686.6792 688.5632 731.9798 751.4495 817.0087 842.0987 842.5317 874.6494 887.4166 972.3416 1003.6665 1062.7131 1084.7547 1119.9097 1146.6147 1187.8912 1194.6527 1280.9750 1287.6200 1355.9384 1368.4168 1427.9313 1464.6203 1481.9487 1514.9499 1614.6922 1642.5969 2845.0444 3029.7610 3113.4992 3205.0345 3208.4725
redmass: 2.3756 10.4750 11.3512 10.7449 9.9425 6.7571 6.1612 8.8443 9.5092 9.7582 3.4290 12.2298 5.8668 7.8169 6.6570 10.2747 11.7607 5.0606 8.9367 9.3973 4.3951 10.2559 1.4098 1.0677 1.3527 5.8061 4.5098 1.4525 4.0838 1.0373 3.1282 4.4355 1.4337 9.1568 2.2592 2.4423 1.9492 3.2563 3.5666 1.2784 3.0934 6.9221 7.9695 1.0673 1.0536 1.1192 1.0935 1.0942
irintensity: 13.2721 0.9991 2.7591 2.2886 3.1194 0.0534 13.9510 10.3843 1.3726 0.3166 3.9146 3.2211 11.5789 5.1831 4.7118 0.0740 3.8779 0.8050 6.2051 1.4739 40.4609 41.3011 47.6381 112.6783 53.4035 153.4855 1.1882 4.1857 116.0620 0.0106 36.2873 433.5969 30.1539 207.7016 188.6449 90.1079 68.6654 206.2637 132.5578 11.7798 69.7372 80.4276 63.2301 125.5796 92.0673 20.5952 11.4310 1.1893
temp: 298.150 k
press: 1.00000 atm
elementType: 8 8 8 8 8 7 6 6 6 6 6 6 6 1 1 1 1 1
symmnumber: 1
zpe: 308298.3 jmol-1
zpe.correction: 0.117425 hartree
zpe.thermalcorrener: 0.127684 hartree
zpe.thermalcorrenthalpy: 0.128628 hartree
zpe.thermalcorrgfe: 0.080738 hartree
zpe.sumelectzpe: -699.570892 hartree
zpe.sumelectthermal: -699.560633 hartree
zpe.sumelectthermalent: -699.559689 hartree
zpe.sumelectthermalfe: -699.607579 hartree
dipole: 5.8098 0.4945 0.0004
dipole: 5.8308
quadrupole: -74.2822 -80.6788 -72.8907
quadrupole: -5.2273 0.0083 -0.0053
quadrupole: 1.6683 -4.7282 3.0598 -5.2273 0.0083 -0.0053
hfenergy: -699.6883168 hartree
pointgroup: C01 [X(C7H5N1O5)]
dipole: 2.2897662 0.1377647 -0.0220199 debye
dipolederiv: -1.3398828 0.1404461 0.0139438 0.463939 -0.422411 -0.0079377 0.019609 -0.0044418 -0.250523 -1.6159204 0.1453195 0.017028 0.0040564 -0.4431398 -0.0033378 0.0148369 -0.0048752 -0.2494588 -0.6980778 0.490023 0.0120063 0.2957216 -0.8074673 -0.010567 0.0086477 -0.0127934 -0.3702535 -0.542594 -0.1708357 0.0004057 -0.5659191 -0.9389468 -0.006616 -0.0071129 -0.0114639 -0.2257766 -1.0225903 0.1044364 0.0100606 0.5070021 -0.552281 -0.0106665 0.0168537 -0.005906 -0.2865122 2.0344251 0.4135685 -0.0129582 0.4418557 1.2492795 0.0145346 -0.0117558 0.0149872 0.2000764 0.597047 -0.4666537 -0.0139795 -1.1777619 -0.0382256 0.0111853 -0.0261737 0.0036057 0.0394608 1.47955 -0.134495 -0.0171609 0.5613396 0.3854696 -0.0009056 -0.0052591 0.0065384 0.0945397 0.2345285 0.2789222 0.0011376 -0.1898422 -0.0705362 0.0027693 -0.0073402 -0.0023252 -0.1118085 -1.0311154 -0.5133335 0.0020963 -0.3115295 -0.3526995 -0.0027633 0.0059071 -0.0004754 -0.0063736 -0.5934486 0.3091922 0.0097686 0.1464703 -0.003634 0.0015693 0.0068415 -0.0001538 -0.1832428 0.9228616 -0.516526 -0.0174839 0.0639423 0.700016 0.0091025 -0.0070275 0.015488 0.1251185 1.1852473 -0.0961245 -0.0081552 -0.1963096 0.5911329 0.0026598 -0.009919 0.0015621 0.5569115 0.1166237 -0.0372046 0.0001931 0.0385536 0.0931849 -0.0021724 0.0014868 -0.0014105 0.1957337 0.0930011 -0.0053821 0.0009958 -0.026592 0.0458523 -0.0022915 0.0005836 -0.0025021 0.1946576 -0.0802525 0.0191402 -0.0538428 0.0448318 0.0630471 0.0087851 -0.1452114 0.0247387 -0.0440838 -0.0760531 0.0167998 0.0551515 0.0396164 0.064144 -0.0058992 0.1471738 -0.0213165 -0.0491764 0.3366507 0.0227073 0.0007932 -0.1393743 0.4372149 0.0025509 -0.0021406 0.0007438 0.370711 unknown
polarizability: 182.6689807|4.370927|111.6017265|-1.4296984|1.163332|42.5869887 unknown
InChI: InChI=1S/C7H5NO5/c9-5-2-7-6(12-3-13-7)1-4(5)8(10)11/h1-2,9H,3H2
charge 0 multiplicity 1
18 atoms
O  2.442622 -1.489349 -0.027485
O  2.931513 0.86002 0.007745
O  -1.767097 2.164167 0.080807
O  -2.721019 -1.922857 0.019046
O  -3.421065 0.252113 0.066797
N  -2.455103 -0.6638 0.039717
C  1.246833 -0.734978 -0.001783
C  1.546378 0.658627 0.019124
C  -0.053621 -1.20133 0.004035
C  -1.085845 -0.210531 0.032371
C  0.5629 1.639521 0.046647
C  -0.792604 1.202714 0.053705
C  3.548787 -0.50232 -0.021922
H  -0.315963 -2.260155 -0.011508
H  0.786476 2.706827 0.062732
H  4.152134 -0.633403 0.89135
H  4.133271 -0.601851 -0.9513
H  -2.671797 1.667284 0.08162
