program: Gaussian 09
title: 000297129
version: EM64L-G09RevD.01
frameworkgroup: C1[X(C15H15N5S2)]
method: RPBEPBE
basis: SDD
operation: Freq
keyword: #p
keyword: freq=noraman
keyword: PBEPBE/SDD
title: #p freq=noraman PBEPBE/SDD
converged: YES YES NO NO
title: Mulliken charges:
elementType: S S N N N N N C C C C C C C C C C C C C C C H H H H H H H H H H H H H H H
charge: 0.285106 0.289790 -0.467551 -0.409274 -0.064904 -0.208223 -0.266223 0.426944 0.230357 -0.147355 -0.443239 -0.323912 0.464796 -0.258504 -0.199312 -0.219241 -0.696654 0.479184 -0.256309 -0.762261 -0.709841 -0.767394 0.403457 0.425458 0.229385 0.316339 0.224046 0.224384 0.278284 0.227244 0.241631 0.230836 0.241321 0.273998 0.229776 0.238874 0.238986
chargesum: 0.00000
title: Mulliken charges with hydrogens summed into heavy atoms:
elementType: S S N N N N N C C C C C C C C C C C C C C C
charge: 0.285106 0.289790 -0.064094 0.016184 -0.064904 -0.208223 -0.266223 0.426944 0.230357 -0.147355 -0.213854 -0.007572 0.464796 -0.258504 0.024733 0.005142 -0.418369 0.479184 -0.029065 -0.048473 -0.435843 -0.059757
polarizability: 3.89750673e+02 3.17207685e+00 3.36851326e+02 -3.65766689e-02 4.16754269e-02 9.44248839e+01
1716.lowfreq: -1.5813 -0.0021 -0.0017 -0.0011 5.1076 5.2262 33.1329 36.3818 43.7263
frequency: 33.0790 36.3510 43.7195 45.6544 64.7606 66.6514 123.2492 125.8784 138.9425 144.6878 156.2487 204.3362 218.8780 224.1915 225.9308 250.0741 263.5162 295.9165 310.0207 348.1466 351.4845 408.8510 449.1945 499.3019 511.9231 529.8208 532.3441 539.7727 558.4668 579.0982 614.7528 627.9761 630.2499 641.3961 669.2235 670.0148 697.3380 728.6412 728.7004 750.5768 766.8886 772.4664 798.1475 809.6349 839.8318 842.2644 917.6364 940.2929 952.5505 976.2136 984.9375 986.7055 996.9250 1000.5249 1003.0514 1004.0988 1027.3884 1045.9689 1048.6126 1056.4757 1086.1087 1119.0987 1134.3169 1170.6402 1173.7289 1186.3313 1199.1217 1267.9066 1292.3204 1312.9077 1320.0510 1332.8475 1387.0089 1401.4013 1402.7915 1438.0554 1451.6986 1460.1299 1461.5636 1463.9989 1465.1128 1483.4741 1492.2940 1532.4857 1544.5323 1554.7016 1580.4680 1613.2081 1654.3613 1688.4036 2623.2904 2986.0680 2988.4315 3042.6377 3067.2426 3070.2425 3103.4258 3107.0235 3117.0492 3130.4248 3143.0553 3163.7736 3191.8734 3242.0902 3247.7126
redmass: 4.5399 4.8646 6.3026 4.9070 5.2526 6.0003 2.0387 2.4002 1.3522 1.7901 4.5557 5.3567 8.3668 3.9876 3.6646 6.0358 5.0667 6.4861 6.5688 3.6110 3.7101 2.9419 9.8000 7.8518 3.1640 8.1578 7.4517 4.8341 4.6786 6.3875 6.4614 7.3544 5.6327 6.4317 7.9776 8.1964 1.9350 1.2521 1.2666 6.1779 1.7060 5.8686 5.0563 6.4415 5.8122 1.2627 1.3646 7.0961 1.1792 1.3267 6.0081 5.9626 2.1645 1.7679 1.3051 2.0815 2.0483 1.3581 1.4985 1.1744 1.5669 2.2891 1.6169 1.1253 1.9398 1.1408 2.9151 4.0791 2.9134 4.0931 4.9899 1.6237 7.9982 1.2561 1.2716 3.3394 3.4156 1.0446 1.0443 1.1607 1.2104 2.9023 2.5595 7.8165 4.3118 5.1165 5.1033 5.6957 1.6922 1.7016 1.1013 1.0371 1.0371 1.0862 1.0983 1.0984 1.0988 1.0989 1.0874 1.0874 1.0939 1.0999 1.0950 1.0963 1.0967
irintensity: 0.0073 0.2266 0.1591 1.8764 1.1415 0.1725 0.2969 0.0111 1.4913 0.1658 1.6562 4.2611 6.7154 6.9959 0.4537 1.9172 0.0079 1.1495 0.4821 2.4825 3.7938 0.0009 13.6178 18.1148 10.1066 0.5990 0.1250 7.9307 1.2161 14.9535 0.3810 10.9988 0.1405 0.0021 0.5050 23.8164 40.3285 103.3803 0.9425 3.6069 66.1203 5.6135 16.4835 62.2590 8.0339 2.8617 0.0121 27.8764 84.3223 4.3115 11.0718 4.7279 34.6838 6.1937 3.2239 37.3989 13.1047 0.1373 1.2725 84.9968 28.0283 24.8805 12.1361 0.5889 0.1223 0.6477 28.3486 132.8726 185.8469 113.5447 46.4351 121.9960 13.8847 31.3435 25.9736 121.7661 208.2417 16.0353 15.8166 6.6722 47.6354 274.7837 658.4323 186.9098 45.6078 12.9165 119.1120 125.8848 503.2572 1229.4886 842.3699 29.8346 22.9123 540.9960 17.5109 15.6126 18.2676 13.7877 13.0673 0.6580 32.2291 33.3448 14.3121 1.5657 2.5652
temp: 298.150 k
press: 1.00000 atm
elementType: 16 16 7 7 7 7 7 6 6 6 6 6 6 6 6 6 6 6 6 6 6 6 1 1 1 1 1 1 1 1 1 1 1 1 1 1 1
symmnumber: 1
zpe: 727959.9 jmol-1
zpe.correction: 0.277265 hartree
zpe.thermalcorrener: 0.297584 hartree
zpe.thermalcorrenthalpy: 0.298528 hartree
zpe.thermalcorrgfe: 0.226503 hartree
zpe.sumelectzpe: -1648.930911 hartree
zpe.sumelectthermal: -1648.910592 hartree
zpe.sumelectthermalent: -1648.909648 hartree
zpe.sumelectthermalfe: -1648.981673 hartree
dipole: -0.6278 3.4624 0.0199
dipole: 3.5189
quadrupole: -118.1648 -129.6389 -151.3272
quadrupole: -3.7106 0.0202 -0.0016
quadrupole: 14.8788 3.4047 -18.2836 -3.7106 0.0202 -0.0016
hfenergy: -1649.2081762 hartree
pointgroup: C01 [X(C15H15N5S2)]
dipole: 0.1763182 -1.3717209 -0.0633932 debye
polarizability: 385.900356|11.864588|339.2359147|16.2995248|12.3005294|95.8906124 unknown
InChI: InChI=1S/C15H15N5S2/c1-10-8-21-14(16-10)19-13(18-12-6-4-3-5-7-12)20-15-17-11(2)9-22-15/h3-9,18-19H,1-2H3
charge 0 multiplicity 1
37 atoms
S  1.821008 -3.496884 0.053659
S  2.617446 3.430899 0.427251
N  -1.247969 0.038928 0.05465
N  0.949114 -0.84177 0.134405
N  0.616606 1.52424 0.230412
N  -0.694852 -2.598589 -0.043013
N  2.947261 0.787709 0.313042
C  -2.343046 0.942053 0.036138
C  0.098254 0.287523 0.141975
C  0.563311 -2.158334 0.04877
C  -3.636499 0.354611 -0.063552
C  -2.219706 2.355687 0.109439
C  -0.775875 -4.002672 -0.115151
C  1.962691 1.719844 0.309173
C  -4.787066 1.166013 -0.089684
C  -3.383531 3.15416 0.081943
C  0.440889 -4.656833 -0.077156
C  4.235081 1.335657 0.402852
C  -4.66921 2.574548 -0.017015
C  -2.129756 -4.651188 -0.224754
C  4.270766 2.718142 0.47162
C  5.429886 0.418946 0.415903
H  -1.469435 -0.985093 -0.007741
H  1.98121 -0.537509 0.204144
H  -3.731893 -0.737006 -0.119531
H  -1.224685 2.796123 0.185781
H  -5.775307 0.698992 -0.166837
H  -3.279447 4.243748 0.138556
H  0.640274 -5.724831 -0.116281
H  -5.563549 3.20647 -0.037467
H  -2.650232 -4.313673 -1.139507
H  -2.04251 -5.749033 -0.259065
H  -2.763277 -4.377847 0.638545
H  5.142007 3.364602 0.545807
H  6.367427 0.993252 0.492956
H  5.378565 -0.280102 1.270695
H  5.468348 -0.188086 -0.507157
