program: Gaussian 09
title: 000297113
version: EM64L-G09RevD.01
frameworkgroup: C1[X(C14H23N3O2)]
method: RPBEPBE
basis: SDD
operation: Freq
keyword: #p
keyword: freq=noraman
keyword: PBEPBE/SDD
title: #p freq=noraman PBEPBE/SDD
converged: YES YES NO NO
title: Mulliken charges:
elementType: O O N N N C C C C C C C C C C C C C C H H H H H H H H H H H H H H H H H H H H H H H
charge: -0.193824 -0.210035 -0.234039 -0.025598 -0.282757 0.283811 -0.439902 -0.432339 -0.624576 0.146848 -0.447457 -0.443593 0.185163 -0.341395 -0.395466 -0.382874 -0.370923 -0.400494 -0.402202 0.220241 0.202241 0.202204 0.221393 0.265809 0.261127 0.209074 0.233952 0.227920 0.210333 0.265896 0.206438 0.219166 0.214650 0.213701 0.195776 0.214160 0.188698 0.249069 0.198707 0.198984 0.189077 0.203040
chargesum: 0.00000
title: Mulliken charges with hydrogens summed into heavy atoms:
elementType: O O N N N C C C C C C C C C C C C C C
charge: -0.193824 -0.210035 -0.234039 -0.025598 -0.016861 0.283811 -0.017420 -0.008743 -0.097640 0.146848 -0.004431 -0.005340 0.185163 0.084208 0.032885 0.027062 0.066843 -0.002803 -0.010085
polarizability: 2.12015778e+02 5.73288730e+00 1.57667715e+02 -2.56488959e+00 -2.02663348e+00 1.43143716e+02
1716.lowfreq: -7.5180 -0.0008 -0.0003 0.0005 6.6984 12.2323 19.6720 27.5646 48.8434
frequency: 19.6369 26.8251 48.8272 67.7997 90.7481 122.4548 131.2547 168.9386 176.3917 200.5312 259.0279 267.7808 275.6875 289.5583 305.6193 319.5711 328.4049 362.4386 384.4721 405.2372 442.9717 458.3513 460.4698 478.4337 505.3286 557.8247 581.5825 585.4322 640.4219 651.3946 713.2448 724.1683 729.3943 798.2990 802.5884 808.0428 840.2231 845.8789 858.0719 875.6376 886.3125 944.2282 952.0625 961.3961 979.2300 982.6259 1000.3214 1005.1768 1033.5961 1062.6713 1064.5191 1076.6905 1085.8394 1101.3224 1116.4399 1137.3157 1143.1536 1146.9270 1152.9607 1164.1084 1178.1973 1187.7178 1189.0923 1204.6398 1233.3529 1241.4941 1249.1993 1268.0512 1281.3299 1285.4656 1287.4532 1311.3054 1319.2670 1320.3922 1332.3429 1337.6091 1345.0169 1346.5773 1352.5801 1356.8998 1364.3062 1378.3668 1396.4752 1439.5682 1443.6191 1448.8554 1454.9379 1455.3497 1458.4230 1461.7927 1466.4920 1473.3951 1475.7979 1483.5126 1490.5362 1626.8445 1687.2161 2914.8903 2916.1678 2925.7725 2955.3216 2957.5426 2964.6318 2977.3834 2980.3800 2980.4860 2983.9005 3009.6673 3012.3783 3018.2846 3026.8846 3029.1051 3033.2806 3042.1838 3043.1827 3046.1436 3051.0374 3054.6907 3070.3942 3450.8755
redmass: 3.6764 4.7058 3.3983 3.9514 3.4863 5.7382 3.8080 2.6679 2.7400 3.6258 2.0679 3.9077 2.0800 3.8306 4.5736 2.2558 2.1922 2.1371 2.7720 4.1443 3.0042 3.3125 3.1331 1.5976 1.8125 2.6886 3.6812 5.2765 3.3051 3.4731 2.1158 6.2076 3.3967 3.1087 1.4276 1.6286 2.4898 2.0754 1.7828 2.1426 2.8060 1.9772 1.9899 2.2061 2.6113 1.6864 2.2192 2.8841 1.6093 1.8853 2.0981 3.0120 2.1928 2.5000 2.3675 1.6758 3.3403 2.0097 2.8219 3.2487 1.5004 1.5909 1.2449 1.2607 1.4954 1.4801 1.4721 1.2242 1.5331 1.5677 1.3748 1.6964 1.5907 1.6158 1.2188 1.3831 1.4358 1.4450 1.3591 1.4587 1.3193 1.3880 1.3873 1.0819 1.1194 1.2709 1.0847 1.0945 1.0833 1.0830 1.0894 1.0729 1.0836 1.1000 1.0811 11.3792 11.9346 1.0684 1.0689 1.0682 1.0618 1.0687 1.0625 1.0593 1.0644 1.0611 1.0639 1.0623 1.0935 1.0954 1.0988 1.0913 1.0928 1.1036 1.1009 1.1033 1.0943 1.0990 1.1001 1.0751
irintensity: 0.0798 0.0758 0.0934 2.1778 2.0466 3.5314 7.2486 3.5156 2.0817 2.0091 1.6694 3.1441 0.1411 1.5091 0.4245 2.1822 2.4483 0.7108 13.6061 3.1439 11.5786 6.1107 2.6193 1.2466 85.7199 8.3562 4.2890 8.6704 21.5449 36.8092 39.5280 3.1446 8.1680 8.8726 3.6486 1.2578 12.1207 2.8711 3.2805 3.1744 10.8256 56.9441 5.1343 3.7193 27.0134 10.2368 3.0676 1.3430 0.8813 5.5140 7.2308 60.4014 6.5358 16.8651 23.5766 23.8596 48.0962 21.3250 13.6889 71.1973 6.6770 16.8056 2.6825 0.3248 11.6415 2.5599 3.1545 6.1213 12.4940 13.2907 8.3624 4.5952 11.8282 14.2163 28.3264 2.6584 2.8243 5.2262 6.4589 0.1057 7.1203 5.3901 0.6198 11.5535 11.0375 0.3575 11.3407 11.7814 5.6225 5.2943 19.7373 3.2062 10.2549 31.6079 11.4110 469.9070 13.4865 45.7900 51.6112 51.1340 29.3392 44.2502 31.5218 23.9558 32.6554 30.9454 17.3194 10.2854 75.1647 31.9586 69.9525 71.9025 28.4253 5.6251 51.9743 62.1084 19.6726 42.9002 5.1845 1.2701
temp: 298.150 k
press: 1.00000 atm
elementType: 8 8 7 7 7 6 6 6 6 6 6 6 6 6 6 6 6 6 6 1 1 1 1 1 1 1 1 1 1 1 1 1 1 1 1 1 1 1 1 1 1 1
symmnumber: 1
zpe: 949140.6 jmol-1
zpe.correction: 0.361509 hartree
zpe.thermalcorrener: 0.379468 hartree
zpe.thermalcorrenthalpy: 0.380412 hartree
zpe.thermalcorrgfe: 0.314645 hartree
zpe.sumelectzpe: -860.485008 hartree
zpe.sumelectthermal: -860.467049 hartree
zpe.sumelectthermalent: -860.466105 hartree
zpe.sumelectthermalfe: -860.531871 hartree
dipole: -0.7453 -0.1310 -0.1596
dipole: 0.7734
quadrupole: -106.7880 -119.6849 -112.1226
quadrupole: -3.8055 1.4120 7.6763
quadrupole: 6.0772 -6.8197 0.7425 -3.8055 1.4120 7.6763
hfenergy: -860.8465163 hartree
pointgroup: C01 [X(C14H23N3O2)]
dipole: -0.292176 0.0221801 0.0820116 debye
polarizability: 212.142338|-5.588358|157.0138667|-0.8453106|3.467973|143.6710043 unknown
InChI: InChI=1S/C14H23N3O2/c18-12-11-14(5-7-15-8-6-14)13(19)17(12)16-9-3-1-2-4-10-16/h15H,1-11H2
charge 0 multiplicity 1
42 atoms
O  -1.119137 1.7318 -0.280369
O  1.127786 -2.379618 0.096035
N  0.27458 -0.178254 -0.136155
N  1.490826 0.531551 -0.196046
N  -4.714472 0.797237 0.223278
C  -2.102574 -0.56853 0.000869
C  -3.135965 -0.490333 -1.166406
C  -2.853913 -0.351419 1.357279
C  -1.329939 -1.921962 -0.000538
C  -0.991268 0.492532 -0.163426
C  -4.037657 0.759909 -1.095871
C  -3.756551 0.899577 1.350109
C  0.157896 -1.588391 0.008877
C  2.096009 0.722355 1.14907
C  2.32362 0.25861 -1.403136
C  3.387865 1.568182 1.120729
C  3.629537 -0.550074 -1.194557
C  4.674344 0.768846 0.797948
C  4.809514 0.301719 -0.669732
H  -3.780439 -1.388726 -1.09657
H  -2.610723 -0.523799 -2.141022
H  -2.127373 -0.294202 2.191681
H  -3.494405 -1.23952 1.523529
H  -1.549126 -2.523312 -0.902387
H  -1.568213 -2.553943 0.872533
H  -4.808963 0.691999 -1.885461
H  -3.42073 1.66646 -1.290154
H  -3.120332 1.813022 1.295586
H  -4.327556 0.936712 2.296521
H  -5.435541 1.528936 0.264345
H  2.315818 -0.253172 1.640953
H  1.335779 1.243523 1.761628
H  2.580894 1.230819 -1.873039
H  1.66656 -0.271254 -2.115532
H  3.502629 2.015332 2.127472
H  3.259629 2.413564 0.416595
H  3.915403 -0.965507 -2.182128
H  3.427924 -1.413646 -0.533729
H  4.714492 -0.115445 1.467244
H  5.555157 1.392708 1.050701
H  4.922779 1.190394 -1.326473
H  5.748038 -0.279881 -0.76695
