program: Gaussian 09
title: 000297140
version: EM64L-G09RevD.01
frameworkgroup: C1[X(C16H22N2O2S)]
method: RPBEPBE
basis: SDD
operation: Freq
keyword: #p
keyword: freq=noraman
keyword: PBEPBE/SDD
title: #p freq=noraman PBEPBE/SDD
converged: NO YES NO NO
title: Mulliken charges:
elementType: S O O N N C C C C C C C C C C C C C C C C H H H H H H H H H H H H H H H H H H H H H H
charge: 0.959580 -0.544479 -0.516275 0.006014 -0.510291 0.416255 -0.119936 -0.537545 -0.505193 -0.439905 -0.565374 -0.574396 0.138158 -0.790274 -0.037139 -0.233765 -0.240597 -0.384183 -0.345887 0.453533 -0.800487 0.223076 0.218355 0.219572 0.218701 0.223768 0.221734 0.213911 0.217129 0.242599 0.239023 0.226926 0.215102 0.212436 0.217257 0.306599 0.287422 0.281268 0.242923 0.241926 0.232691 0.240418 0.229348
chargesum: 0.00000
title: Mulliken charges with hydrogens summed into heavy atoms:
elementType: S O O N N C C C C C C C C C C C C C C C C
charge: 0.959580 -0.544479 -0.516275 0.006014 -0.203692 0.416255 0.103140 -0.099618 -0.062724 -0.004260 -0.105645 -0.108447 0.138158 -0.145479 -0.037139 0.053657 0.040671 -0.141260 -0.103961 0.453533 -0.098029
polarizability: 2.67668976e+02 1.19573874e+01 2.17477944e+02 -1.20129167e+01 7.92554561e+00 1.91022349e+02
1716.lowfreq: -23.2500 -18.4248 -4.9991 -0.0010 -0.0007 0.0007 2.0118 6.4100 14.9448
frequency: -19.3650 -17.9627 14.2188 24.5370 42.1239 65.2387 91.5158 99.9062 123.0355 130.1784 175.3039 180.8416 192.0761 224.5675 242.7492 274.1370 279.7462 298.7109 321.0850 342.1977 353.8270 368.5411 386.4826 395.7224 408.3525 415.2461 420.8306 426.7286 463.0101 508.6105 540.1177 546.4297 583.1839 599.1668 621.8361 709.6217 718.9486 766.8367 776.4656 779.6574 804.9408 814.8467 819.3741 828.6434 849.7143 850.5482 870.8948 877.1813 916.0568 930.3555 945.6930 951.4679 964.3287 970.2831 976.2443 984.0493 987.4979 997.3253 1008.7728 1031.6665 1047.5655 1049.2326 1055.5135 1079.2680 1117.4019 1118.6040 1135.5012 1150.7456 1176.7699 1184.3124 1192.4868 1217.9969 1237.9461 1248.1465 1258.7209 1268.6496 1270.4926 1284.5283 1295.2761 1297.1761 1301.0876 1315.1419 1336.1427 1349.6836 1382.1721 1384.8747 1392.3577 1398.4884 1440.7595 1445.6560 1465.0408 1467.4036 1470.6609 1471.8127 1473.7649 1474.3602 1474.5718 1487.1304 1595.7001 1597.2304 1598.5567 2950.5121 2954.5200 2964.8305 2980.0309 2980.3348 2991.1249 3005.3050 3020.0338 3031.0349 3042.8472 3044.7263 3050.3906 3058.7220 3061.2668 3061.6263 3071.3582 3091.6958 3134.0160 3138.8411 3163.7970 3168.5771 3242.6919
redmass: 2.4005 1.1786 4.5517 3.7624 3.8728 6.0357 4.6207 2.7316 4.2019 6.0543 6.2160 2.4907 1.3894 7.9787 2.6418 3.2983 3.1570 3.6547 3.5101 3.1509 2.3437 2.9035 2.7320 7.1719 2.8785 4.1258 3.5881 2.8713 2.5278 3.0660 4.0575 3.7615 4.6105 3.7264 6.9545 3.2715 4.6569 2.8546 4.8119 1.5054 4.4218 3.2768 3.5655 1.4024 1.6708 1.5802 1.7228 2.2721 1.9718 1.7946 5.4928 2.2181 1.3483 2.2149 2.1208 1.3943 1.5696 3.8571 2.3181 1.4289 1.7829 1.5892 2.4641 1.2672 1.3517 1.2891 1.6232 1.4782 1.5376 1.1439 1.5196 3.0109 1.6080 1.5405 1.9025 1.6173 1.4281 1.4866 1.6799 1.2638 1.6948 1.4954 2.0227 1.4682 5.6934 1.2132 2.8569 1.2707 1.0822 1.0860 1.0911 1.0759 1.0690 1.0545 1.1520 1.0598 2.1119 1.0933 6.4907 6.9627 8.4081 1.0646 1.0624 1.0361 1.0387 1.0597 1.0595 1.0640 1.0982 1.0863 1.1020 1.1033 1.0966 1.0982 1.0956 1.0996 1.1038 1.0996 1.0894 1.0897 1.0956 1.0963 1.0742
irintensity: 0.4913 1.0239 0.6982 0.0490 0.5253 0.6821 1.3680 0.4520 0.8931 1.3801 0.0821 4.7145 0.7877 16.0405 1.3488 8.1261 10.2408 0.2633 9.8900 8.3170 4.7507 8.2591 3.9762 34.3780 1.0946 21.0211 37.8538 21.3946 2.7224 74.6401 4.9565 1.8368 7.7112 58.3945 0.1345 0.8470 9.7553 30.4425 8.9772 6.7794 106.9922 7.1680 50.3243 29.2865 19.6488 20.7297 0.7308 0.7798 5.1327 21.0985 52.9447 9.1996 1.8255 0.3107 12.8833 0.2956 3.4329 1.9185 2.1920 1.3410 3.6665 15.9031 26.7522 1.3757 3.8903 8.4689 4.3656 1.8096 2.5068 11.3354 0.4453 5.6593 7.2706 5.1168 2.3902 3.0392 3.6160 16.9274 3.5372 2.4643 5.0936 7.0204 17.1144 6.0343 1.5736 11.5884 10.4931 15.1216 8.9145 10.7312 10.0961 5.8154 14.5906 12.5069 18.6624 6.0920 19.8784 9.3409 7.7838 10.8381 35.4528 14.1732 24.1663 37.0417 29.4947 48.3530 32.0016 48.9846 12.3918 71.7243 14.1692 4.4377 6.5183 46.1610 18.9939 25.5004 99.7705 15.3728 13.2379 10.0155 2.1998 7.4992 10.6822
temp: 298.150 k
press: 1.00000 atm
elementType: 16 8 8 7 7 6 6 6 6 6 6 6 6 6 6 6 6 6 6 6 6 1 1 1 1 1 1 1 1 1 1 1 1 1 1 1 1 1 1 1 1 1 1
symmnumber: 1
zpe: 918187.0 jmol-1
zpe.correction: 0.349719 hartree
zpe.thermalcorrener: 0.369603 hartree
zpe.thermalcorrenthalpy: 0.370548 hartree
zpe.thermalcorrgfe: 0.299918 hartree
zpe.sumelectzpe: -1279.130004 hartree
zpe.sumelectthermal: -1279.110119 hartree
zpe.sumelectthermalent: -1279.109175 hartree
zpe.sumelectthermalfe: -1279.179804 hartree
dipole: -2.7470 5.5208 -1.9668
dipole: 6.4725
quadrupole: -117.4939 -138.8812 -133.6174
quadrupole: 23.5464 -2.3063 5.0288
quadrupole: 12.5036 -8.8837 -3.6199 23.5464 -2.3063 5.0288
hfenergy: -1279.4797226 hartree
pointgroup: C01 [X(C16H22N2O2S1)]
dipole: -0.9561372 2.3303594 0.3738645 debye
polarizability: 269.6840833|11.1311584|201.9283922|0.6943956|16.3745212|204.5567933 unknown
InChI: InChI=1S/C16H22N2O2S/c1-12-3-5-15(6-4-12)21(19,20)18-17-14-9-13-7-8-16(2,10-13)11-14/h3-6,13,18H,7-11H2,1-2H3
charge 0 multiplicity 1
43 atoms
S  1.815231 -2.040345 -0.88989
O  2.464997 -2.445368 -2.328591
O  1.569242 -3.139577 0.28385
N  -0.675611 -0.979251 -0.359723
N  0.166483 -1.159235 -1.449289
C  -3.77879 0.730593 0.567367
C  -3.613237 0.718728 -1.839378
C  -4.641893 0.485683 -0.704929
C  -2.992747 2.029846 0.182689
C  -2.901459 2.031756 -1.384419
C  -2.789603 -0.469431 0.706741
C  -2.60872 -0.470369 -1.894315
C  -1.944585 -0.675281 -0.538098
C  -4.60453 0.883722 1.857834
C  2.750136 -0.594432 -0.150919
C  2.72698 -0.433672 1.242103
C  3.458016 0.250805 -1.020578
C  3.456095 0.647099 1.787498
C  4.178219 1.321049 -0.449307
C  4.182174 1.538917 0.955598
C  4.94095 2.711892 1.548895
H  -4.09015 0.827234 -2.830563
H  -5.459168 1.23119 -0.765015
H  -5.097923 -0.522474 -0.72691
H  -1.995075 2.048091 0.65748
H  -3.542829 2.919504 0.542267
H  -3.428103 2.909183 -1.802258
H  -1.857474 2.075562 -1.743752
H  -3.384866 -1.388839 0.895859
H  -2.116341 -0.336163 1.572528
H  -1.84043 -0.271247 -2.666872
H  -3.152533 -1.391339 -2.194635
H  -5.334946 1.709225 1.763645
H  -5.166361 -0.041232 2.090133
H  -3.954026 1.10616 2.72499
H  -0.167667 -1.772568 -2.226904
H  2.174227 -1.138333 1.870963
H  3.459681 0.062285 -2.098806
H  3.460295 0.796945 2.873075
H  4.746881 1.993802 -1.10176
H  5.923392 2.846326 1.062311
H  4.377358 3.654842 1.411292
H  5.109609 2.581815 2.631296
