program: Gaussian 09
title: 000297097
version: EM64L-G09RevD.01
frameworkgroup: C1[X(C14H25NO3)]
method: RPBEPBE
basis: SDD
operation: Freq
keyword: #p
keyword: freq=noraman
keyword: PBEPBE/SDD
title: #p freq=noraman PBEPBE/SDD
converged: YES YES NO NO
title: Mulliken charges:
elementType: O O O N C C C C C C C C C C C C C C H H H H H H H H H H H H H H H H H H H H H H H H H
charge: -0.264107 -0.446100 -0.253283 -0.053820 -0.077115 -0.431143 -0.420387 -0.405471 -0.420927 -0.382481 -0.257956 0.037029 -0.417962 -0.436503 -0.402068 -0.394666 0.196694 -0.617055 0.214725 0.215087 0.195711 0.197620 0.234943 0.212294 0.196229 0.199766 0.212948 0.187209 0.200054 0.265888 0.233186 0.232161 0.215065 0.223780 0.211753 0.221656 0.182158 0.178471 0.222670 0.353759 0.225207 0.189083 0.225897
chargesum: 0.00000
title: Mulliken charges with hydrogens summed into heavy atoms:
elementType: O O O N C C C C C C C C C C C C C C
charge: -0.264107 -0.092341 -0.253283 -0.053820 0.137610 -0.020345 0.012175 0.003053 -0.008213 0.004783 0.007932 0.270215 0.029264 -0.000970 0.001745 0.006475 0.196694 0.023133
polarizability: 2.01556483e+02 -4.88022669e+00 1.51301758e+02 -1.25302482e+00 -4.28738769e+00 1.39252241e+02
1716.lowfreq: -25.1778 -11.0870 -6.7999 0.0009 0.0010 0.0011 11.1805 24.3514 36.9747
frequency: -19.2795 23.9541 36.8013 63.5042 67.3128 109.8122 121.3881 151.5186 182.4947 210.9626 225.9923 231.5317 244.3616 266.3193 289.2712 310.4543 320.6373 346.2938 365.1390 374.3060 392.9416 401.8754 439.9425 451.0212 466.8339 481.2115 508.3277 581.3999 604.0039 685.6187 715.2774 744.4527 779.8671 801.6171 817.2421 818.9235 838.3329 863.8772 868.5100 888.4848 915.2134 924.9461 925.3565 969.1476 980.7651 992.4128 1003.6141 1007.2627 1031.6241 1051.0981 1053.2685 1068.3422 1091.3835 1096.8481 1114.8740 1125.1710 1132.6459 1132.8779 1141.9160 1148.9054 1150.8908 1154.7577 1206.5558 1211.8050 1247.1845 1259.5845 1262.3190 1265.6943 1271.2986 1275.8534 1278.5569 1296.3955 1306.7749 1308.6161 1329.1235 1330.7366 1337.1098 1338.1100 1351.3310 1352.5506 1355.3174 1358.6556 1358.9617 1376.0997 1387.7691 1432.7799 1451.5355 1459.3774 1461.3764 1463.5731 1464.2393 1466.2867 1471.2846 1472.7593 1480.3216 1481.8159 1483.2713 1606.6055 2816.7886 2826.9397 2862.1211 2959.4895 2962.6836 2971.8507 2973.4650 2976.0619 2984.1860 3005.8110 3008.4214 3012.7020 3020.4377 3024.7677 3027.8742 3032.0459 3033.7358 3037.2807 3041.6207 3053.9869 3075.5409 3078.5229 3081.2766 3086.3494 3494.3776
redmass: 3.4171 3.9841 3.3237 6.1887 4.2117 3.9204 3.6473 3.3726 3.5660 1.4633 3.8146 2.4084 1.6245 2.3256 2.8405 3.4283 2.6146 2.0646 2.6440 2.1555 1.7818 1.6741 2.8293 2.7034 2.3077 3.0128 3.3289 2.2151 2.8406 6.3179 5.9614 3.3785 1.4710 3.6753 1.7268 1.4610 2.3370 2.5866 2.6070 3.0021 3.0013 1.5572 1.6819 2.5725 1.4381 4.5614 2.6299 2.6609 2.3845 1.5497 1.7793 1.6840 1.5529 1.6574 1.1155 1.9966 1.9857 1.9514 1.5418 1.8770 1.6443 2.5395 1.5770 1.3330 1.4223 1.3342 1.3279 1.3236 1.7957 1.4504 1.3354 1.5430 1.2388 1.3795 1.4294 1.3171 1.4426 1.3602 1.4761 1.4268 1.4040 1.4819 1.4420 1.3814 1.3475 1.1697 1.0913 1.0841 1.0872 1.0747 1.0608 1.0901 1.0844 1.0825 1.1045 1.0915 1.0547 9.5286 1.0719 1.0695 1.0571 1.0756 1.0623 1.0659 1.0614 1.0626 1.0731 1.0694 1.0645 1.0730 1.0729 1.0956 1.0981 1.0856 1.0990 1.0869 1.1022 1.0981 1.1038 1.1010 1.1038 1.0858 1.0650
irintensity: 0.3128 0.8634 0.6163 1.2642 0.6968 2.2113 0.5439 0.5112 0.2800 0.8178 4.2425 1.8945 2.3134 3.2034 9.4453 36.6969 4.6034 8.2061 4.4319 5.9204 29.8320 115.2895 3.5661 0.6834 1.0088 0.5565 1.9226 4.7400 4.8451 4.0969 12.7655 14.3104 0.0846 0.5535 2.4681 0.5845 9.0790 2.7847 8.9574 14.8711 27.8832 15.2969 12.0517 17.0940 4.4643 72.0013 109.8077 26.3438 18.7927 0.2982 0.6077 24.1170 14.4679 0.7540 10.6209 9.8127 23.2158 8.1677 10.0073 5.9249 16.7235 239.8482 2.1194 13.6982 110.4392 11.3970 4.3258 40.7782 25.2211 13.9485 2.6546 2.5497 5.2666 1.4554 2.5099 0.3191 0.5165 1.0167 8.9522 3.0147 1.6242 3.4673 5.3862 4.5333 26.7286 2.9347 7.1252 6.5296 3.5164 0.3709 21.0507 15.3344 12.6120 24.8652 12.0195 6.9419 8.5961 149.1898 53.2167 100.1941 197.0645 15.4643 37.7001 34.4446 7.6144 32.1780 66.1133 3.3969 9.7375 36.6513 43.2234 66.6171 76.6866 57.9892 10.9446 26.4294 103.6444 30.3184 11.7320 35.6782 36.8260 17.8290 18.4391
temp: 298.150 k
press: 1.00000 atm
elementType: 8 8 8 7 6 6 6 6 6 6 6 6 6 6 6 6 6 6 1 1 1 1 1 1 1 1 1 1 1 1 1 1 1 1 1 1 1 1 1 1 1 1 1
symmnumber: 1
zpe: 987009.5 jmol-1
zpe.correction: 0.375932 hartree
zpe.thermalcorrener: 0.393664 hartree
zpe.thermalcorrenthalpy: 0.394608 hartree
zpe.thermalcorrgfe: 0.329985 hartree
zpe.sumelectzpe: -827.454677 hartree
zpe.sumelectthermal: -827.436945 hartree
zpe.sumelectthermalent: -827.436001 hartree
zpe.sumelectthermalfe: -827.500623 hartree
dipole: 2.6572 -1.7397 -0.6089
dipole: 3.2338
quadrupole: -101.1402 -118.4442 -108.4839
quadrupole: 5.7851 4.5711 -0.9014
quadrupole: 8.2159 -9.0881 0.8722 5.7851 4.5711 -0.9014
hfenergy: -827.8306088 hartree
pointgroup: C01 [X(C14H25N1O3)]
dipole: -1.0527839 -0.6201253 0.3547163 debye
polarizability: 201.6408935|4.3037118|152.4426345|-1.3593617|1.7284214|138.0269547 unknown
InChI: InChI=1S/C14H25NO3/c1-15-9-7-12(8-10-15)18-14(17)13(16)11-5-3-2-4-6-11/h11-13,16H,2-10H2,1H3
charge 0 multiplicity 1
43 atoms
O  -0.30572 0.250161 -0.705142
O  2.664931 2.214887 -1.007651
O  0.129203 2.388658 0.129597
N  -4.361903 -0.719594 0.187216
C  2.682045 0.424183 0.731722
C  2.031542 -0.881887 1.268914
C  4.201747 0.206417 0.489753
C  2.320631 -2.111964 0.373473
C  4.497824 -1.023516 -0.402582
C  3.841401 -2.306752 0.160761
C  2.007525 0.977383 -0.566899
C  -1.786279 0.449867 -0.496606
C  -2.164723 0.162995 0.964775
C  -2.495894 -0.511799 -1.453913
C  -3.700413 0.228943 1.114372
C  -4.021792 -0.428929 -1.225387
C  0.527651 1.289477 -0.33784
C  -5.819485 -0.793511 0.40758
H  2.559787 1.218749 1.498593
H  0.940024 -0.756473 1.399833
H  2.451564 -1.071842 2.278006
H  4.688375 0.0604 1.476168
H  4.631362 1.120086 0.040523
H  1.818229 -1.988918 -0.606587
H  1.882562 -3.017064 0.837696
H  5.593077 -1.160962 -0.48885
H  4.127743 -0.84072 -1.431759
H  4.313711 -2.557491 1.133697
H  4.027179 -3.163663 -0.515785
H  2.112771 0.26791 -1.401465
H  -2.011042 1.506186 -0.743518
H  -1.689446 0.898982 1.637229
H  -1.818084 -0.850753 1.237901
H  -2.152694 -1.543156 -1.255273
H  -2.253702 -0.260356 -2.502452
H  -3.982883 -0.035574 2.149779
H  -4.044308 1.283459 0.936521
H  -4.389008 0.587035 -1.534673
H  -4.531516 -1.16903 -1.869018
H  2.260191 2.96018 -0.485873
H  -6.257212 -1.563296 -0.25287
H  -6.348558 0.173353 0.209299
H  -6.023611 -1.08536 1.453235
