program: Gaussian 09
title: 000297107
version: EM64L-G09RevD.01
frameworkgroup: C1[X(C18H20N2O2)]
method: RPBEPBE
basis: SDD
operation: Freq
keyword: #p
keyword: freq=noraman
keyword: PBEPBE/SDD
title: #p freq=noraman PBEPBE/SDD
converged: YES YES NO NO
title: Mulliken charges:
elementType: O O N N C C C C C C C C C C C C C C C C C C H H H H H H H H H H H H H H H H H H H H
charge: -0.207771 -0.181963 -0.052404 -0.183883 0.216590 -0.447968 -0.450879 -0.451368 0.147500 -0.414376 -0.429137 0.126916 0.546604 -0.618013 -0.464349 -0.446676 -0.373810 -0.229344 -0.240528 0.268919 -0.244207 -0.492271 0.256469 0.225810 0.207279 0.226671 0.224134 0.214585 0.213041 0.210700 0.234460 0.193258 0.223045 0.220726 0.266708 0.262846 0.232372 0.243293 0.228101 0.228028 0.230342 0.280550
chargesum: 0.00000
title: Mulliken charges with hydrogens summed into heavy atoms:
elementType: O O N N C C C C C C C C C C C C C C C C C C
charge: -0.207771 -0.181963 -0.052404 -0.183883 0.216590 -0.191499 -0.017790 -0.000563 0.147500 0.013250 0.016023 0.126916 0.546604 0.019017 0.065205 -0.214304 -0.130517 -0.001243 -0.012500 0.268919 -0.013865 -0.211721
polarizability: 2.22058802e+02 7.44213490e+00 2.03566376e+02 1.78553221e+01 -5.39648680e+00 1.73087681e+02
1716.lowfreq: -7.5596 -0.0006 0.0005 0.0007 7.1196 11.5814 25.0713 34.1375 38.1447
frequency: 24.8148 34.0861 38.1123 48.2444 60.0472 74.8017 113.3069 118.4579 150.5004 183.0836 213.1049 230.8391 237.6683 246.0067 255.7813 272.8206 279.6525 296.7593 303.9639 322.3881 345.6482 370.3418 375.4312 403.6939 472.0360 476.2946 496.5609 530.9507 561.1234 586.7725 604.1524 615.6861 635.4653 673.1896 683.2924 692.0276 706.2648 730.0232 743.5019 756.4974 779.7894 810.4635 834.2060 843.2860 854.9990 900.2305 922.1530 935.3503 937.0619 974.8596 978.8114 990.2008 996.8120 1000.0419 1019.6712 1027.5776 1029.9355 1051.0233 1065.2157 1077.9604 1087.2545 1097.8985 1130.0079 1134.8170 1153.1769 1170.6585 1174.1609 1188.7373 1195.5091 1197.7681 1209.6396 1226.7093 1262.7554 1287.8464 1290.2794 1304.0924 1313.3889 1320.4476 1324.6563 1341.0005 1347.7383 1356.8359 1364.5749 1380.2015 1383.1852 1430.5414 1432.9788 1441.9241 1444.3024 1455.6172 1464.2503 1465.8846 1483.6508 1484.2199 1485.3813 1593.3615 1611.2505 1622.4816 1685.6739 2150.1660 2861.2505 2874.1282 2905.9070 2979.5338 2995.5946 3009.6564 3016.9526 3017.8996 3024.6214 3040.0757 3044.6636 3063.5753 3069.3414 3074.5632 3119.3360 3120.7273 3135.0283 3147.1037 3164.6640 3423.7929
redmass: 4.5999 5.5409 3.8614 5.5562 4.7030 3.6618 5.5558 5.6081 4.0063 3.4849 3.2594 3.4453 1.5259 2.9084 2.5972 3.8479 3.8109 2.7583 3.4977 3.1085 3.6939 1.9820 3.4983 2.8072 3.3039 5.4705 3.5415 3.0568 4.7646 4.0211 9.2115 6.4617 1.2366 1.8872 2.2456 3.8354 1.6433 5.3299 3.1058 5.7309 2.1769 1.5925 3.5129 4.3098 1.2533 2.3656 1.7114 3.1779 2.1751 2.1968 1.3960 6.0266 1.6796 2.1100 2.8811 2.1412 1.8664 3.2663 2.0706 2.1421 1.6627 1.7334 1.9403 3.0180 2.9523 2.4111 1.0570 1.1430 1.2242 1.8863 1.8412 1.4421 1.7692 1.6734 1.4968 1.8529 2.3373 1.4564 1.5195 1.2846 1.3572 1.3299 1.6530 1.3965 5.6916 1.0962 1.1816 1.2346 1.7358 1.1004 1.0510 1.0732 1.2219 1.8447 1.0653 5.9447 6.1608 10.8252 11.3487 5.9785 1.0580 1.0680 1.0685 1.0598 1.0628 1.0575 1.0744 1.0873 1.0898 1.0863 1.1017 1.1014 1.1030 1.1009 1.0866 1.0880 1.0909 1.0958 1.1015 1.1609
irintensity: 0.0023 0.2371 0.0642 0.4290 0.5235 0.4082 0.9185 3.2832 4.3705 1.2219 0.5701 0.9778 0.4547 3.4917 0.2884 0.5002 7.8650 10.3787 3.6381 0.3487 8.5940 10.5735 3.4747 0.1185 0.2407 9.4096 5.6850 4.6766 8.4092 8.6387 12.7110 3.4550 63.9980 23.8355 65.2854 6.6696 54.4299 12.6227 3.7277 18.4096 25.8961 0.5944 2.4678 0.5136 0.1923 39.5834 2.7518 9.0478 19.0481 33.7546 0.4453 2.5464 9.2247 12.8910 3.9899 7.4667 0.8849 3.0349 9.0955 4.4450 11.7656 7.2192 4.7831 82.7052 36.3380 39.9180 0.2301 2.3516 1.0163 0.3093 7.6722 9.6083 16.9634 13.7585 7.6006 32.2739 119.6473 46.4032 19.4026 5.2612 14.6256 2.0845 61.3255 8.3914 0.3803 46.3496 1.1343 1.2113 13.7735 8.4737 29.8063 0.1370 38.9084 8.2849 14.5809 0.9779 21.2476 453.5893 40.1974 0.2891 88.3587 96.3438 59.2283 21.6055 19.7891 10.5486 42.7898 64.8274 36.3782 10.3871 25.5343 17.8055 0.3249 34.0532 6.9911 1.1104 8.4014 29.9453 24.5616 61.4674
temp: 298.150 k
press: 1.00000 atm
elementType: 8 8 7 7 6 6 6 6 6 6 6 6 6 6 6 6 6 6 6 6 6 6 1 1 1 1 1 1 1 1 1 1 1 1 1 1 1 1 1 1 1 1
symmnumber: 1
zpe: 894666.0 jmol-1
zpe.correction: 0.340760 hartree
zpe.thermalcorrener: 0.361144 hartree
zpe.thermalcorrenthalpy: 0.362088 hartree
zpe.thermalcorrgfe: 0.290690 hartree
zpe.sumelectzpe: -956.205476 hartree
zpe.sumelectthermal: -956.185093 hartree
zpe.sumelectthermalent: -956.184148 hartree
zpe.sumelectthermalfe: -956.255547 hartree
dipole: 1.1059 -1.3818 -0.5675
dipole: 1.8586
quadrupole: -127.7183 -122.6633 -130.7920
quadrupole: 3.5968 14.8237 0.8389
quadrupole: -0.6604 4.3946 -3.7342 3.5968 14.8237 0.8389
hfenergy: -956.5462367 hartree
pointgroup: C01 [X(C18H20N2O2)]
dipole: 0.217112 0.6480362 -0.2599987 debye
polarizability: 213.0761638|-9.417057|211.2065602|-9.4062268|19.0461999|174.4301348 unknown
InChI: InChI=1S/C18H20N2O2/c1-3-11-20-16(21)15(14-7-5-4-6-8-14)18(17(20)22)9-12-19(2)13-10-18/h1,4-8,15H,9-13H2,2H3
charge 0 multiplicity 1
42 atoms
O  -2.452083 0.216492 -0.83579
O  0.10921 -2.287714 2.167052
N  -1.176793 3.729455 -0.101775
N  -1.341463 -1.26993 0.609484
C  -0.352107 0.902247 0.396996
C  0.677375 -0.096591 1.065245
C  -0.91623 1.863042 1.502171
C  0.227746 1.768799 -0.752522
C  -1.493276 -0.02927 -0.063453
C  -1.868915 2.932463 0.938454
C  -0.740713 2.869373 -1.231152
C  -0.16235 -1.344505 1.390595
C  1.888994 -0.471068 0.206335
C  -1.991415 4.872187 -0.560097
C  -2.322728 -2.368304 0.514884
C  3.149461 0.109801 0.490516
C  1.780095 -1.366634 -0.889407
C  4.27896 -0.188201 -0.304289
C  2.908248 -1.667299 -1.683149
C  -1.981836 -3.35399 -0.530653
C  4.161306 -1.077375 -1.39658
C  -1.714045 -4.188292 -1.396245
H  1.048309 0.326378 2.01533
H  -0.049988 2.382176 1.955801
H  -1.42066 1.281917 2.299253
H  0.514081 1.133332 -1.609699
H  1.151824 2.248109 -0.376691
H  -2.799708 2.453026 0.543704
H  -2.169341 3.613575 1.757313
H  -0.213909 3.508676 -1.964791
H  -1.611888 2.402918 -1.749692
H  -2.946675 4.565246 -1.05641
H  -1.411255 5.475553 -1.281371
H  -2.244905 5.518103 0.300075
H  -2.36002 -2.866974 1.500608
H  -3.305887 -1.913783 0.295607
H  3.249344 0.792462 1.343422
H  0.820376 -1.845075 -1.120811
H  5.247166 0.267424 -0.068542
H  2.810726 -2.365284 -2.522161
H  5.036306 -1.313893 -2.012104
H  -1.484137 -4.917175 -2.152363
