program: Gaussian 09
title: 000026816
version: EM64L-G09RevD.01
frameworkgroup: C1[X(C15H22O3)]
method: RPBEPBE
basis: SDD
operation: Freq
keyword: #pfreq=noraman
keyword: PBEPBE/SDD
title: #p freq=noraman PBEPBE/SDD
converged: YES YES NO NO
title: Mulliken charges:
elementType: O O O C C C C C C C C C C C C C C C H H H H H H H H H H H H H H H H H H H H H H
charge: -0.195244 -0.260451 -0.379925 -0.379366 -0.396018 -0.342838 -0.543010 -0.360009 0.119592 0.209112 -0.697371 0.201776 -0.304989 -0.586348 0.388861 -0.416610 -0.242450 -0.683799 0.172505 0.235280 0.188108 0.223588 0.194474 0.175555 0.224166 0.230225 0.199614 0.190251 0.211558 0.207198 0.212944 0.254256 0.243610 0.247962 0.212594 0.212634 0.355251 0.210289 0.233595 0.233428
chargesum: 0.00000
title: Mulliken charges with hydrogens summed into heavy atoms:
elementType: O O O C C C C C C C C C C C C C C C
charge: -0.195244 -0.260451 -0.024673 0.028419 0.015677 0.027192 -0.088618 0.029856 0.119592 0.209112 -0.065671 0.201776 -0.050733 -0.342739 0.388861 -0.168648 0.182779 -0.006487
polarizability: 2.71065316e+02 -1.30822381e+01 1.67109487e+02 1.83781969e+01 5.12884964e+00 1.16459260e+02
1716.lowfreq: -0.0012 -0.0004 0.0003 5.3407 6.3737 11.5863 20.1745 23.8253 43.8725
frequency: 19.8433 22.6567 43.5268 52.9420 67.9620 90.5410 95.4653 111.2671 117.1228 130.6304 142.8089 176.5364 214.3122 225.7894 230.6977 245.6039 277.9296 287.0840 300.9604 320.1518 340.6184 390.7811 414.5465 428.1632 450.1124 462.0029 539.8380 543.6052 557.4035 619.3947 633.7239 691.6945 724.4520 729.0109 731.1631 764.3292 786.4818 829.0412 839.4496 841.0948 850.5087 878.5405 889.1314 936.7837 946.1604 963.5973 975.9114 1017.0692 1030.9535 1036.7832 1075.9097 1082.8229 1103.5838 1108.5682 1116.6931 1124.3377 1135.2863 1163.7375 1187.9624 1193.8935 1206.1066 1226.0001 1257.8299 1262.7271 1267.6962 1280.5448 1289.7176 1294.3333 1298.2566 1317.1674 1335.3659 1353.0782 1362.4907 1364.1578 1387.6595 1395.3334 1404.7404 1419.3380 1438.7337 1450.8608 1461.0580 1465.1837 1469.6703 1476.4231 1477.0154 1479.6666 1487.5865 1488.1160 1506.9775 1558.7621 1600.3253 1621.2882 2951.1806 2956.4447 2958.7805 2963.9234 2967.0943 2970.3514 2981.8838 2995.2863 2998.9140 3014.1279 3019.8155 3024.4670 3034.1738 3055.4287 3066.8801 3068.8174 3096.3540 3108.2185 3135.3775 3157.9634 3179.1831 3532.4727
redmass: 4.9758 4.2491 2.5744 3.7726 2.2044 3.4190 3.4418 2.1613 2.9305 1.9973 2.7063 3.7064 2.9439 2.0801 1.3278 1.4147 5.1143 3.4472 4.6436 3.2019 3.7118 3.5031 2.4905 1.6856 2.7729 2.9132 3.3550 3.6209 6.8143 4.5507 3.4142 2.1987 2.7449 1.3002 3.3043 1.3551 1.4078 1.1173 2.0311 1.7600 2.0391 2.3566 1.8075 2.4192 1.6134 1.4415 2.9503 2.5773 2.9851 2.6858 1.9701 1.9485 2.0721 2.0209 2.1819 2.0519 1.4345 1.3714 1.7030 1.4633 1.5189 2.4645 1.3078 1.1429 1.3539 3.0585 1.0862 1.2954 1.2319 1.3272 1.5372 1.5593 1.5537 1.4072 1.2186 2.0842 1.8452 4.2641 1.1243 1.0871 1.0396 1.0691 1.0718 1.0456 1.0689 1.0722 1.1223 1.0871 2.3368 7.1956 8.3232 6.5609 1.0596 1.0638 1.0615 1.0555 1.0588 1.0382 1.0633 1.0948 1.0363 1.0978 1.0983 1.1078 1.0982 1.1024 1.1002 1.0998 1.0989 1.1015 1.0916 1.0867 1.0957 1.0655
irintensity: 0.9934 0.1372 1.2829 0.0839 1.9515 0.2309 3.4955 0.7767 0.1925 0.0459 0.8468 2.7192 0.0050 0.8074 0.2830 0.1671 6.7029 4.5334 1.9088 6.2811 5.2243 6.2203 43.8600 71.1613 15.6806 7.0371 13.6898 3.6825 7.5907 26.8270 6.4255 10.3482 3.9489 6.3695 3.9421 1.7207 34.5104 3.5327 21.6501 53.2721 2.9307 4.0267 2.7808 33.0616 9.0438 3.7235 53.6827 3.5280 14.2369 43.0004 0.5051 0.0902 266.1200 65.5038 9.8878 35.6145 4.8059 149.6629 64.0808 1.5549 33.7295 191.6295 5.7450 0.0543 41.6679 121.1735 0.8399 6.5780 18.9240 2.5195 36.7123 0.4886 1.2723 12.4215 12.6924 19.2705 16.5142 32.9950 23.3747 18.2326 12.4008 0.7203 1.1240 10.9273 23.9695 3.1970 21.5554 17.8650 15.5458 228.7279 92.8533 325.6926 9.4610 14.8766 46.6365 35.1679 84.7141 32.2866 45.1850 10.1303 25.1038 14.4485 21.5851 31.5840 16.4920 43.9288 90.5776 72.0327 27.0993 33.7525 5.9675 8.0667 8.9825 22.9600
temp: 298.150 k
press: 1.00000 atm
elementType: 8 8 8 6 6 6 6 6 6 6 6 6 6 6 6 6 6 6 1 1 1 1 1 1 1 1 1 1 1 1 1 1 1 1 1 1 1 1 1 1
symmnumber: 1
zpe: 886733.8 jmol-1
zpe.correction: 0.337739 hartree
zpe.thermalcorrener: 0.357844 hartree
zpe.thermalcorrenthalpy: 0.358789 hartree
zpe.thermalcorrgfe: 0.286898 hartree
zpe.sumelectzpe: -809.059450 hartree
zpe.sumelectthermal: -809.039345 hartree
zpe.sumelectthermalent: -809.038401 hartree
zpe.sumelectthermalfe: -809.110291 hartree
dipole: 5.1402 -3.0657 1.0161
dipole: 6.0706
quadrupole: -93.5251 -100.1627 -112.0346
quadrupole: -0.4218 0.9312 4.1983
quadrupole: 8.3824 1.7448 -10.1271 -0.4218 0.9312 4.1983
hfenergy: -809.3971894 hartree
pointgroup: C01 [X(C15H22O3)]
dipole: -2.0224262 0.170777 -1.2589506 debye
polarizability: 271.0231026|-15.8570377|120.1618362|16.2753669|14.0443986|163.4491245 unknown
InChI: InChI=1S/C15H22O3/c1-3-5-6-7-8-14(16)13-10-9-12(18-4-2)11-15(13)17/h9-11,17H,3-8H2,1-2H3
charge 0 multiplicity 1
40 atoms
O  1.449213 -0.493701 1.46032
O  -4.818553 0.679606 0.037561
O  -0.756401 0.605047 2.591998
C  3.801818 0.258046 -0.649904
C  3.054244 -1.090543 -0.761582
C  5.327432 0.082145 -0.484311
C  1.529281 -0.937199 -0.933746
C  6.092706 1.423009 -0.403665
C  0.808246 -0.519387 0.36953
C  -0.64905 -0.185207 0.28223
C  7.615769 1.238951 -0.228119
C  -1.40431 0.345226 1.384794
C  -1.367754 -0.405187 -0.926366
C  -2.783308 0.617708 1.254803
C  -3.456468 0.374421 0.037355
C  -2.741123 -0.144005 -1.074028
C  -5.584809 0.447095 -1.207927
C  -7.026295 0.854787 -0.919465
H  3.600401 0.868315 -1.556547
H  3.40192 0.821274 0.214802
H  3.457707 -1.659932 -1.623558
H  3.252623 -1.685767 0.149877
H  5.527279 -0.508216 0.434005
H  5.726585 -0.514756 -1.332208
H  1.309955 -0.199848 -1.732395
H  1.08955 -1.899282 -1.271801
H  5.690268 2.019344 0.44029
H  5.893578 2.011735 -1.32287
H  7.842139 0.68399 0.701902
H  8.045272 0.666111 -1.07212
H  8.140038 2.211325 -0.1777
H  -0.830252 -0.807182 -1.789526
H  -3.360219 1.02349 2.094645
H  -3.232866 -0.342448 -2.029392
H  -5.147076 1.056441 -2.024302
H  -5.514788 -0.62437 -1.484591
H  -1.397829 0.982917 3.248107
H  -7.649459 0.702238 -1.819261
H  -7.445609 0.250416 -0.097327
H  -7.081157 1.91849 -0.632208
