program: Gaussian 09
title: 000297028
version: EM64L-G09RevD.01
frameworkgroup: C1[X(C15H25NO3)]
method: RPBEPBE
basis: SDD
operation: Freq
keyword: #p
keyword: freq=noraman
keyword: PBEPBE/SDD
title: #p freq=noraman PBEPBE/SDD
converged: YES YES NO NO
title: Mulliken charges:
elementType: O O O N C C C C C C C C C C C C C C C H H H H H H H H H H H H H H H H H H H H H H H H H
charge: -0.326129 -0.441586 -0.201471 -0.057952 -0.007637 -0.435987 -0.433431 -0.375550 -0.378794 -0.052319 0.023166 0.190423 -0.616409 -0.392481 -0.749932 -0.710412 0.126155 -0.079888 -0.752585 0.262456 0.220726 0.236666 0.214406 0.214905 0.184912 0.218477 0.217377 0.186714 0.197082 0.223401 0.212572 0.225018 0.188717 0.224646 0.222780 0.212794 0.252337 0.225005 0.204199 0.219050 0.350611 0.253611 0.248050 0.256304
chargesum: 0.00000
title: Mulliken charges with hydrogens summed into heavy atoms:
elementType: O O O N C C C C C C C C C C C C C C C
charge: -0.326129 -0.090975 -0.201471 -0.057952 0.254820 0.021405 -0.004120 0.027839 0.025297 0.144763 0.023166 0.190423 0.021973 0.043492 -0.062021 -0.062158 0.126155 -0.079888 0.005381
polarizability: 2.23034122e+02 -9.09696441e+00 1.60008192e+02 -9.25370266e+00 1.82806769e+00 1.50295013e+02
1716.lowfreq: -27.1854 -10.3150 0.0005 0.0006 0.0008 5.4909 17.4246 21.3775 32.2030
frequency: -16.0117 21.3701 32.0464 45.5736 53.9794 57.5513 73.3759 78.5264 100.5075 130.3387 154.8868 185.3365 192.2497 195.9913 218.4164 225.7860 244.9141 255.4120 269.2618 284.0195 299.3972 318.4521 338.1872 347.3558 360.9608 369.3535 381.4100 396.5467 416.1467 427.9418 451.7501 481.2703 492.9321 563.4146 616.1676 666.0652 702.5837 733.2797 742.1997 773.6314 796.5788 825.0484 846.0725 864.3191 897.1105 906.8021 943.3435 954.6673 969.6741 994.4202 997.6939 1002.6372 1031.0141 1035.1946 1040.5076 1041.0742 1047.0312 1079.7832 1084.1612 1109.0220 1122.4211 1124.0357 1142.6730 1148.3757 1151.8560 1167.5086 1169.3708 1188.6279 1241.1744 1251.2661 1268.1650 1272.6663 1295.9596 1318.7554 1325.9427 1330.0620 1343.7800 1344.1765 1357.6415 1363.4285 1377.7830 1379.8104 1383.8342 1392.3404 1399.6479 1433.2031 1438.2472 1450.1228 1460.0333 1460.3240 1460.5549 1463.3405 1466.1552 1466.9798 1478.1235 1479.3191 1481.8637 1485.7477 1490.9075 1647.3042 2300.0793 2833.0677 2845.8548 2863.3826 2962.4956 2974.3557 2976.9675 2978.9138 2987.0926 3002.4700 3003.4663 3019.3775 3030.0865 3030.4935 3032.8328 3042.4537 3065.5248 3066.3835 3067.2101 3067.5948 3071.4111 3077.6246 3079.2367 3083.1260 3093.7973 3503.1250
redmass: 3.6726 1.0115 3.7589 3.7785 3.7017 3.6052 2.2702 3.3293 3.3534 3.6927 3.8852 1.2441 1.9645 2.2968 2.6521 1.4121 1.7885 2.3451 3.6895 3.7919 2.8662 2.6678 2.9389 2.1569 2.5511 3.1226 1.2842 3.2123 3.2437 4.3741 3.0524 3.5417 3.0634 7.9087 3.3623 3.0295 7.1474 5.9057 3.2277 1.2675 1.5714 3.6352 2.1545 3.0049 2.2905 3.4127 3.9981 7.1454 1.2290 2.3162 1.8898 1.5010 1.4042 1.3991 1.7474 2.5031 2.1878 1.9197 2.0074 4.1436 1.2099 1.5997 2.5237 2.0423 2.4940 2.1020 1.8785 1.2018 1.2488 1.3161 2.3387 1.2458 1.3153 1.5614 1.4042 1.3371 1.4704 1.3797 1.4881 1.4949 1.4889 1.4102 1.3459 1.2272 1.2358 1.1764 1.0859 1.0898 1.0413 1.0692 1.0419 1.0565 1.0518 1.0577 1.0585 1.0781 1.0642 1.0730 1.0452 11.9470 11.7929 1.0707 1.0668 1.0603 1.0823 1.0372 1.0350 1.0600 1.0359 1.0617 1.0630 1.0727 1.0867 1.0994 1.0871 1.0875 1.0986 1.0988 1.0983 1.1016 1.1015 1.1010 1.0999 1.0988 1.0992 1.0645
irintensity: 0.1463 0.0122 0.2266 0.8832 2.0374 1.9618 0.3267 1.1084 1.5297 3.2126 3.0138 0.2407 0.2692 1.9318 3.3729 0.6331 4.5574 3.6522 4.5187 10.1878 4.5971 13.8399 4.1754 1.6772 7.5208 4.4481 90.9271 18.0832 10.1017 6.7585 1.8970 3.9664 3.7991 1.4671 6.6768 1.3817 12.6651 3.6966 8.7527 4.5409 1.1478 15.8594 2.3025 20.3547 2.9777 78.0439 58.0365 42.5238 8.5632 48.6495 8.2889 4.0238 3.3876 2.7089 25.7865 76.1073 36.1117 16.2879 22.4477 291.0719 1.5022 2.9259 24.6560 1.2921 38.7115 27.5339 31.5853 8.6360 1.2509 9.2594 21.2631 6.9925 13.1685 1.8260 18.5276 0.9380 2.8948 4.1077 2.3223 0.2609 32.2992 36.8914 3.8117 25.2123 1.4324 1.5787 14.6668 16.5280 14.2280 9.0231 11.5409 18.9806 10.8542 0.5432 15.1081 8.6255 10.0369 17.2774 6.9353 139.7191 36.7948 84.9893 61.5660 198.8259 23.8368 39.9479 31.8936 19.4320 26.0824 6.9249 17.3012 50.6768 56.2213 21.5840 34.9744 36.1445 10.4272 58.2338 12.4466 14.8398 39.1631 32.6900 55.1046 37.0800 13.3945 18.0402
temp: 298.150 k
press: 1.00000 atm
elementType: 8 8 8 7 6 6 6 6 6 6 6 6 6 6 6 6 6 6 6 1 1 1 1 1 1 1 1 1 1 1 1 1 1 1 1 1 1 1 1 1 1 1 1 1
symmnumber: 1
zpe: 982413.4 jmol-1
zpe.correction: 0.374182 hartree
zpe.thermalcorrener: 0.395864 hartree
zpe.thermalcorrenthalpy: 0.396808 hartree
zpe.thermalcorrgfe: 0.322730 hartree
zpe.sumelectzpe: -865.435666 hartree
zpe.sumelectthermal: -865.413983 hartree
zpe.sumelectthermalent: -865.413039 hartree
zpe.sumelectthermalfe: -865.487117 hartree
dipole: -1.8183 1.3508 -0.0841
dipole: 2.2667
quadrupole: -102.2676 -113.7314 -120.5086
quadrupole: 1.2462 -6.1155 -1.1711
quadrupole: 9.9016 -1.5622 -8.3394 1.2462 -6.1155 -1.1711
hfenergy: -865.809847 hartree
pointgroup: C01 [X(C15H25N1O3)]
dipole: 0.7281316 -0.5032416 -0.1087659 debye
polarizability: 222.58388|-9.8640828|160.0331036|10.331428|-0.0722222|150.7203441 unknown
InChI: InChI=1S/C15H25NO3/c1-5-9-15(18,12(3)6-2)14(17)19-13-7-10-16(4)11-8-13/h12-13,18H,6-8,10-11H2,1-4H3
charge 0 multiplicity 1
44 atoms
O  0.636804 0.809922 0.422752
O  -1.435572 0.230665 2.002562
O  -0.804175 1.607152 -1.233763
N  4.060598 -0.272407 0.146942
C  1.79696 1.569682 -0.18048
C  2.373996 0.76764 -1.360227
C  2.822652 1.734451 0.947495
C  3.035373 -0.543084 -0.890669
C  3.466881 0.387885 1.335578
C  -1.313494 -1.498438 0.191207
C  -1.622572 0.0143 0.543142
C  -0.604432 0.916386 -0.216721
C  4.820676 -1.485234 0.507399
C  -1.401495 -1.772008 -1.333764
C  -2.238366 -2.422653 1.011459
C  -0.928473 -3.18838 -1.727989
C  -3.000782 0.398466 0.214695
C  -4.159104 0.714532 -0.05744
C  -5.533193 1.120294 -0.382317
H  1.393767 2.53924 -0.524677
H  3.139264 1.400187 -1.849274
H  1.582547 0.563301 -2.103014
H  2.343477 2.198935 1.82859
H  3.612668 2.419427 0.586218
H  2.2465 -1.245754 -0.511872
H  3.528329 -1.035121 -1.749404
H  4.269352 0.562065 2.075941
H  2.697369 -0.265342 1.823329
H  -0.262193 -1.665493 0.511915
H  -2.447723 -1.618505 -1.663687
H  -0.792289 -1.029734 -1.886619
H  5.299986 -1.905756 -0.394787
H  4.186197 -2.285763 0.966683
H  5.616892 -1.225946 1.228108
H  -3.275866 -2.372004 0.633395
H  -1.898119 -3.471463 0.951097
H  -2.2446 -2.118642 2.072111
H  -1.569978 -3.972942 -1.289138
H  0.109678 -3.370529 -1.388291
H  -0.949584 -3.315709 -2.825882
H  -0.451958 0.23465 2.156804
H  -6.011625 1.614685 0.482997
H  -6.156497 0.251431 -0.662753
H  -5.543981 1.833511 -1.226855
