program: Gaussian 09
title: 000297091
version: EM64L-G09RevD.01
frameworkgroup: C1[X(C22H24N2O5S)]
method: RPBEPBE
basis: SDD
operation: Freq
keyword: #p
keyword: freq=noraman
keyword: PBEPBE/SDD
title: #p freq=noraman PBEPBE/SDD
converged: NO YES NO NO
title: Mulliken charges:
elementType: S O O O O O N N C C C C C C C C C C C C C C C C C C C C C C H H H H H H H H H H H H H H H H H H H H H H H H
charge: 0.326928 -0.232408 -0.200659 -0.196419 -0.226461 -0.260905 -0.091982 -0.357707 0.179337 -0.446090 -0.441083 -0.386395 -0.383759 0.132850 -0.341576 0.211017 -0.446278 0.467923 -0.487996 -0.348188 -0.331403 0.273986 -0.349106 -0.351377 -0.274402 0.328785 -0.250907 -0.143313 -0.516847 -0.537667 0.240707 0.215849 0.239173 0.211247 0.231415 0.231634 0.225297 0.215092 0.196540 0.203904 0.220920 0.243192 0.223153 0.270895 0.266467 0.271267 0.244745 0.256312 0.259567 0.250211 0.269864 0.248089 0.222962 0.223602
chargesum: 0.00000
title: Mulliken charges with hydrogens summed into heavy atoms:
elementType: S O O O O O N N C C C C C C C C C C C C C C C C C C C C C C
charge: 0.326928 -0.232408 -0.200659 -0.196419 -0.226461 -0.260905 -0.091982 -0.357707 0.179337 0.010465 0.009337 0.076654 0.056629 0.132850 0.058868 0.211017 0.017834 0.467923 0.006053 -0.081721 -0.060136 0.273986 -0.104362 -0.095066 -0.274402 0.328785 0.008660 0.106898 -0.246983 0.156986
polarizability: 4.18047354e+02 -3.60235829e+01 2.49704116e+02 -1.31782392e+01 1.03045551e+00 2.14449963e+02
1716.lowfreq: -4.6532 -2.4884 0.0009 0.0009 0.0016 6.5887 8.7952 12.4194 17.9001
frequency: 8.2425 12.3330 17.4893 28.2282 32.8747 40.4822 55.5281 64.0223 83.2246 97.4065 102.1401 116.3213 135.7791 156.3504 167.5983 180.5370 194.3135 204.0754 209.2940 230.8211 244.2160 254.8603 262.3440 277.0419 291.9021 310.1146 332.6171 351.1728 367.4390 371.8403 409.6419 414.4264 425.5234 426.6390 448.8029 472.3118 478.0979 497.8119 521.4213 545.6327 553.9082 564.5039 589.7700 600.1618 625.0532 630.7677 634.0055 678.8941 683.5446 705.9899 715.4865 722.6446 728.3202 730.5849 735.4912 761.3372 795.0579 804.5977 816.6232 820.0688 822.0483 833.2502 843.8579 868.3307 915.5651 920.7347 934.8783 943.9439 949.9935 951.8199 952.8590 958.1891 978.7840 986.4712 1003.9513 1025.6470 1030.4347 1048.5719 1060.6648 1066.8638 1087.5550 1090.1878 1097.9643 1113.2517 1117.9182 1122.5291 1127.4814 1142.7303 1157.0441 1159.2476 1167.0885 1183.0726 1185.7005 1192.8471 1203.0799 1226.5796 1236.0340 1246.0689 1270.5049 1271.2909 1289.4845 1309.0301 1310.4097 1313.3148 1318.9609 1336.9484 1339.1214 1340.8955 1345.6538 1356.7643 1369.7239 1380.6946 1396.2065 1428.8522 1437.8286 1441.1115 1449.0702 1452.2248 1462.4405 1465.4917 1468.5182 1473.1113 1474.3891 1478.5375 1484.3652 1503.6240 1526.5073 1567.3407 1584.6269 1625.2380 1638.2525 1722.0619 2869.4582 2895.8977 2901.4447 2957.0722 2960.8126 3003.9078 3007.0061 3009.1082 3011.2853 3020.6822 3033.4250 3049.3471 3053.4611 3068.3190 3073.4225 3077.6521 3128.4495 3159.2670 3164.8562 3172.5555 3186.1709 3189.2886 3189.7172 3231.6214
redmass: 7.0791 6.4737 7.3228 5.4120 5.4350 3.9217 6.1473 5.4081 5.9697 3.4018 4.4475 4.4409 4.8208 4.2599 4.6251 3.8232 3.0417 3.3575 4.5722 3.3401 1.9981 2.6446 2.7411 2.6409 5.3855 3.0979 3.5125 4.6867 4.0195 2.5412 4.9506 3.3372 4.7467 5.8166 7.2162 3.6149 3.8014 3.6166 2.5633 2.8412 2.7891 4.4940 5.3441 2.6459 9.1567 7.3111 8.0380 10.1248 6.8472 4.4151 3.9020 1.1701 2.8773 5.4953 5.9796 5.3995 1.8212 1.3245 1.5315 3.1821 4.1816 1.8174 1.3421 2.4464 3.7480 1.4262 1.4071 2.4299 2.9336 2.4432 3.3438 1.3963 3.4448 8.8052 2.6777 2.5242 1.6158 2.4484 1.7001 1.9908 1.6305 2.9429 1.8301 1.2597 2.7334 2.7031 1.4691 1.8465 2.7840 1.3365 2.3527 1.1158 1.4055 1.8487 2.5044 1.4402 2.8457 1.5622 1.4178 1.2391 1.5216 1.6099 1.4626 1.5832 1.3895 1.9201 1.4377 2.3028 2.5898 1.5532 1.3639 6.7064 1.3938 3.6492 1.1738 1.1156 1.0862 6.1488 1.0868 1.0997 1.0499 1.0766 1.0794 1.0833 1.0962 2.4554 5.3037 8.3384 7.4414 6.3464 11.2375 12.8080 1.0699 1.0709 1.0692 1.0626 1.0330 1.0832 1.0611 1.0704 1.0605 1.0925 1.0887 1.1040 1.0905 1.0991 1.1039 1.1038 1.0994 1.0889 1.0892 1.0896 1.0957 1.0967 1.0976 1.1001
irintensity: 0.1941 0.8201 3.1226 0.1142 0.4331 0.9154 0.5736 0.5321 0.4074 2.5206 0.3953 4.6024 5.2725 3.5453 0.4428 4.7530 1.4409 0.1640 8.8843 2.1472 3.3425 2.3665 0.1805 1.4875 15.0433 7.7576 0.5079 0.8815 6.2160 4.4037 3.2912 3.8508 1.6899 8.1942 11.6828 0.0676 0.5357 4.9526 17.4894 6.1559 0.4475 38.5308 28.6813 5.8907 6.1365 3.4407 3.4697 5.5219 0.2049 6.5642 3.6085 103.9889 14.9452 2.0192 28.6067 3.6757 10.3678 14.7051 0.9904 27.5088 19.1140 53.1655 4.1091 19.6933 40.8866 5.6431 6.5240 31.4597 15.5745 85.5693 23.2402 3.2894 15.1025 40.1103 3.4921 69.8108 1.3133 70.2452 19.8929 3.6347 9.1730 65.1384 25.7909 0.1711 31.0043 6.6572 51.8973 24.4391 109.9972 2.2805 130.5288 2.7936 42.6052 20.2578 15.2586 2.8157 275.1254 87.1041 56.5013 7.2373 36.6285 10.0361 9.7484 65.4547 2.2169 73.6372 17.5217 8.2611 134.0160 32.3262 2.4234 7.5923 0.2529 3.9532 23.0204 18.2157 9.3091 88.1182 7.6917 5.8690 14.6416 68.2842 2.6946 18.6732 38.9265 243.0919 21.6271 145.2231 22.2428 45.2669 416.4895 237.0594 79.2968 33.9672 114.6737 65.6472 66.0641 20.0960 17.5215 24.2140 15.8637 8.4111 43.2594 46.0742 26.0459 42.3161 13.3167 29.8903 25.3497 11.3554 4.2570 6.4991 2.1301 0.1014 2.9954 0.7093
temp: 298.150 k
press: 1.00000 atm
elementType: 16 8 8 8 8 8 7 7 6 6 6 6 6 6 6 6 6 6 6 6 6 6 6 6 6 6 6 6 6 6 1 1 1 1 1 1 1 1 1 1 1 1 1 1 1 1 1 1 1 1 1 1 1 1
symmnumber: 1
zpe: 1110958.7 jmol-1
zpe.correction: 0.423142 hartree
zpe.thermalcorrener: 0.451183 hartree
zpe.thermalcorrenthalpy: 0.452128 hartree
zpe.thermalcorrgfe: 0.359679 hartree
zpe.sumelectzpe: -1734.212108 hartree
zpe.sumelectthermal: -1734.184067 hartree
zpe.sumelectthermalent: -1734.183123 hartree
zpe.sumelectthermalfe: -1734.275571 hartree
dipole: 0.1984 -2.7181 3.9825
dipole: 4.8257
quadrupole: -148.5544 -192.2393 -182.6062
quadrupole: -35.4500 -18.3007 -10.1219
quadrupole: 25.9122 -17.7727 -8.1396 -35.4500 -18.3007 -10.1219
hfenergy: -1734.6352502 hartree
pointgroup: C01 [X(C22H24N2O5S1)]
dipole: -0.0244144 -0.9433181 -1.6474643 debye
polarizability: 415.8888959|42.0215468|252.0676576|-7.2953269|2.0933928|214.2448797 unknown
InChI: InChI=1S/C22H24N2O5S/c1-28-17-8-6-16(7-9-17)24-20(26)22(29-21(24)27)10-13-23(14-11-22)12-2-4-18(25)19-5-3-15-30-19/h3,5-9,15H,2,4,10-14H2,1H3
charge 0 multiplicity 1
54 atoms
S  8.080924 0.773113 1.626285
O  -1.111061 1.987242 -0.488669
O  -2.046584 -1.48795 -0.178519
O  -3.15005 3.098106 -0.265925
O  5.765524 -1.175813 1.915938
O  -8.436195 -0.470735 0.864636
N  1.767794 -1.129246 -0.74272
N  -2.986768 0.705413 -0.148556
C  -0.641424 0.555132 -0.482293
C  0.379225 0.388232 0.663809
C  0.02038 0.262087 -1.846288
C  1.111861 -0.967927 0.5823
C  0.761789 -1.091326 -1.836154
C  -1.938414 -0.240006 -0.254727
C  2.627785 -2.341953 -0.820226
C  -2.498434 2.045941 -0.298038
C  3.897376 -2.239377 0.051567
C  -4.376065 0.388649 0.084275
C  4.745839 -1.005345 -0.307677
C  -4.944628 -0.763813 -0.502407
C  -5.166559 1.224986 0.914751
C  5.794845 -0.662925 0.753511
C  -6.296612 -1.089365 -0.263725
C  -6.51425 0.908618 1.144728
C  6.834736 0.31784 0.388785
C  -7.086857 -0.250089 0.560836
C  7.039459 1.018905 -0.80362
C  8.162082 1.912549 -0.766386
C  8.823388 1.898486 0.457788
C  -9.077727 -1.655147 0.28607
H  1.114254 1.20712 0.562105
H  -0.119896 0.49349 1.644191
H  0.746236 1.074153 -2.033495
H  -0.734008 0.281118 -2.654123
H  1.883304 -0.990498 1.370622
H  0.396116 -1.800746 0.78404
H  0.02468 -1.925351 -1.746571
H  1.289479 -1.210827 -2.800193
H  2.924277 -2.462145 -1.881083
H  2.060423 -3.263298 -0.535479
H  4.490525 -3.164252 -0.080058
H  3.643401 -2.200499 1.12574
H  5.238856 -1.138138 -1.290375
H  4.061289 -0.137659 -0.421945
H  -4.334818 -1.418173 -1.12931
H  -4.736339 2.125441 1.359232
H  -6.714159 -1.989024 -0.72462
H  -7.143093 1.543648 1.775305
H  6.397813 0.898343 -1.679805
H  8.469528 2.53921 -1.606788
H  9.700331 2.471524 0.756379
H  -10.112625 -1.630996 0.656921
H  -9.076432 -1.612555 -0.820611
H  -8.581819 -2.586065 0.623571
