program: Gaussian 09
title: 000297008
version: EM64L-G09RevD.01
frameworkgroup: C1[X(C12H16O)]
method: RPBEPBE
basis: SDD
operation: Freq
keyword: #pfreq=noraman
keyword: PBEPBE/SDD
title: #p freq=noraman PBEPBE/SDD
converged: YES YES NO NO
title: Mulliken charges:
elementType: O C C C C C C C C C C C C H H H H H H H H H H H H H H H H
charge: -0.296231 0.203714 0.376913 -0.000331 0.351244 -0.603120 -0.454620 -0.393546 -0.846850 -0.827138 -0.029581 -0.519848 -0.597535 0.203174 0.228624 0.227562 0.229668 0.252071 0.227062 0.224109 0.254074 0.222088 0.227247 0.243543 0.223839 0.214519 0.234333 0.215206 0.209807
chargesum: 0.00000
title: Mulliken charges with hydrogens summed into heavy atoms:
elementType: O C C C C C C C C C C C C
charge: -0.296231 0.203714 0.376913 -0.000331 0.351244 -0.171322 -0.227058 -0.163878 -0.143608 -0.123728 0.213962 0.152844 -0.172523
polarizability: 1.73129976e+02 1.87162401e+00 1.38121279e+02 6.50118662e+00 -7.56199252e-01 8.65656057e+01
1716.lowfreq: -11.7093 -6.5635 -0.0006 0.0001 0.0006 7.2726 35.4281 65.6881 79.3663
frequency: 35.2864 65.6867 79.3464 99.2722 125.8517 135.2140 147.0366 157.1728 159.2643 241.1870 274.9841 298.0531 304.9694 330.6708 364.4314 394.2446 454.0346 490.8599 524.6884 548.3036 579.9888 624.8326 685.6146 726.4385 780.9275 818.6003 838.0281 903.5835 922.2623 935.7841 944.7561 949.3280 977.8152 1008.0568 1017.6789 1043.5951 1046.9569 1051.4208 1111.5209 1113.4794 1149.2930 1169.6745 1185.9587 1218.0488 1259.6260 1267.8397 1281.3839 1293.4001 1364.8514 1391.9168 1395.5591 1400.2254 1421.7920 1439.5120 1447.7009 1456.5702 1467.7860 1468.6711 1469.2882 1479.8500 1482.3922 1488.8111 1581.7208 1612.2339 1651.2180 2955.5214 2971.1703 2971.5345 2999.4554 3041.1790 3048.5979 3053.3402 3056.5667 3082.0071 3083.5104 3091.9870 3105.0255 3109.2591 3114.9417 3140.1811 3191.6095
redmass: 3.1744 3.5965 2.3945 2.6820 1.6030 1.2742 1.2936 1.2676 1.7423 2.9882 2.8273 3.8528 2.7606 3.0998 3.8664 2.2373 4.7645 2.9287 3.1369 3.2204 2.2837 4.1147 2.7040 4.3524 5.1109 1.2636 3.2736 1.6862 2.2339 1.4581 1.9783 1.4109 2.9478 1.1571 1.4877 1.5777 1.5414 2.1056 1.2731 1.8839 1.3895 1.5089 3.2028 1.5108 1.6152 3.5630 1.2720 1.3664 5.6234 1.5623 1.2880 1.7687 1.1857 1.3211 1.1053 1.0593 1.0641 1.0665 1.0845 1.0858 2.9945 1.0853 5.6695 7.4054 4.6140 1.0321 1.0398 1.0387 1.0585 1.1026 1.0962 1.0922 1.1007 1.0643 1.0940 1.0999 1.0948 1.1008 1.0868 1.0968 1.1140
irintensity: 0.1898 0.3685 4.8775 0.6629 0.8225 1.0926 2.1513 0.5259 1.6445 2.2134 2.8287 7.9775 1.3667 1.4520 7.6484 5.9285 0.2527 0.4055 1.3492 1.1261 8.0219 5.9277 7.5027 1.8529 0.4832 28.1270 12.2914 3.2752 33.4406 48.7508 1.8271 1.0089 69.1319 12.6418 6.4919 5.5892 11.8140 33.7475 5.6278 28.5326 1.1098 6.8727 46.6592 5.2489 1.3236 16.0642 0.9983 0.2550 1.6230 13.1757 9.9762 16.4483 2.8187 5.9316 17.9025 5.4843 13.6904 4.6454 20.9908 4.8165 21.4739 36.9058 4.3025 1.7463 23.7163 66.7651 68.5515 6.0715 28.3286 53.3463 16.2666 21.9898 11.0031 14.6158 18.6600 12.7676 7.5932 27.9935 11.2546 31.7799 30.3965
temp: 298.150 k
press: 1.00000 atm
elementType: 8 6 6 6 6 6 6 6 6 6 6 6 6 1 1 1 1 1 1 1 1 1 1 1 1 1 1 1 1
symmnumber: 1
zpe: 641033.5 jmol-1
zpe.correction: 0.244157 hartree
zpe.thermalcorrener: 0.258627 hartree
zpe.thermalcorrenthalpy: 0.259571 hartree
zpe.thermalcorrgfe: 0.202713 hartree
zpe.sumelectzpe: -541.084063 hartree
zpe.sumelectthermal: -541.069594 hartree
zpe.sumelectthermalent: -541.068649 hartree
zpe.sumelectthermalfe: -541.125508 hartree
dipole: -0.9248 0.1578 1.4989
dipole: 1.7683
quadrupole: -71.8221 -75.7239 -79.0393
quadrupole: 3.1335 0.2972 -3.0463
quadrupole: 3.7064 -0.1955 -3.5109 3.1335 0.2972 -3.0463
hfenergy: -541.3282202 hartree
pointgroup: C01 [X(C12H16O1)]
dipole: 0.3479994 0.037155 0.601268 debye
polarizability: 166.489489|14.3909273|144.8274614|-3.6407918|3.2461204|86.4999105 unknown
InChI: InChI=1S/C12H16O/c1-5-6-11-9(2)7-8-10(3)12(11)13-4/h5,7-8H,1,6H2,2-4H3
charge 0 multiplicity 1
29 atoms
O  0.265403 2.118236 0.082793
C  -0.417147 -0.213225 0.3076
C  -0.107706 -1.604041 0.231541
C  0.61724 0.733534 0.073266
C  1.949487 0.353771 -0.244977
C  -1.840911 0.273024 0.572473
C  1.221339 -1.990766 -0.067272
C  2.228166 -1.031882 -0.308287
C  -1.173828 -2.662364 0.460143
C  3.020769 1.386846 -0.54215
C  -2.649447 0.364593 -0.714732
C  0.648503 2.836674 1.310766
C  -3.839872 -0.247219 -0.936981
H  -2.357744 -0.392737 1.287273
H  -1.797004 1.283094 1.02035
H  1.465039 -3.058082 -0.127463
H  3.2435 -1.359838 -0.562606
H  -2.018574 -2.541233 -0.24302
H  -0.757063 -3.674854 0.324414
H  -1.593853 -2.607766 1.483225
H  2.578822 2.291715 -0.993363
H  3.558748 1.699692 0.374729
H  3.775094 0.978884 -1.23724
H  -2.199388 0.988426 -1.500805
H  1.745401 2.831936 1.458849
H  0.162592 2.387776 2.200047
H  0.297468 3.871529 1.174462
H  -4.376034 -0.13049 -1.885647
H  -4.316797 -0.875434 -0.173388
