program: Gaussian 09
title: 000297056
version: EM64L-G09RevD.01
frameworkgroup: C1[X(C24H31NO3)]
method: RPBEPBE
basis: SDD
operation: Freq
keyword: #p
keyword: freq=noraman
keyword: PBEPBE/SDD
title: #p freq=noraman PBEPBE/SDD
converged: NO YES NO NO
title: Mulliken charges:
elementType: O O O N C C C C C C C C C C C C C C C C C C C C C C C C H H H H H H H H H H H H H H H H H H H H H H H H H H H H H H H
charge: -0.314815 -0.467287 -0.238891 -0.088426 0.252480 -0.159279 -0.555951 -0.407129 -0.381077 0.434346 -0.749661 -0.343933 -0.513336 -0.371112 -0.389912 -0.180604 0.291639 -0.250557 -0.245559 -0.496516 0.462959 -0.238982 -0.663532 -0.431798 -0.387585 -0.236478 -0.225579 -0.245224 0.222579 0.264424 0.215328 0.209808 0.217524 0.206174 0.196287 0.243373 0.211659 0.230466 0.188603 0.234091 0.196544 0.238218 0.244890 0.241729 0.223639 0.224339 0.224600 0.237183 0.239309 0.228654 0.332088 0.219314 0.214749 0.241145 0.257668 0.266558 0.223768 0.221990 0.225097
chargesum: 0.00000
title: Mulliken charges with hydrogens summed into heavy atoms:
elementType: O O O N C C C C C C C C C C C C C C C C C C C C C C C C
charge: -0.314815 -0.135199 -0.238891 -0.088426 0.252480 0.063300 -0.076200 0.020203 0.021384 0.434346 -0.064162 0.078761 -0.078574 -0.126223 -0.148182 0.043036 0.291639 -0.026218 -0.020959 -0.020023 0.462959 -0.010328 0.011676 -0.174130 -0.121028 -0.012710 -0.003589 -0.020128
polarizability: 3.18384895e+02 1.99999425e+01 2.50693213e+02 -1.10973819e+01 1.33125564e+01 2.31166868e+02
1716.lowfreq: -3.6899 -0.0006 -0.0004 0.0003 5.8877 11.4937 15.5600 20.4208 24.2867
frequency: 15.3149 19.6298 23.9948 30.6978 40.1053 42.5782 54.5300 63.4050 69.4576 81.9975 100.8975 114.7952 144.7008 173.4928 191.4742 198.1395 204.7158 210.0552 226.7785 227.9046 242.3605 270.8097 281.1456 284.0726 291.6439 310.1243 314.9472 343.3023 363.4290 366.2695 395.3698 401.4903 405.0298 422.8937 439.1350 479.3980 508.7321 525.6463 538.7516 561.4612 570.5300 587.3943 599.7311 616.0215 617.2001 648.1832 660.9575 698.1717 702.9483 707.5814 731.0011 749.4075 765.4703 771.1034 793.1457 816.3895 851.1463 854.7603 861.3173 866.2157 878.6979 889.6855 918.6116 923.6973 933.4085 939.8355 975.9668 976.6398 982.1458 984.6031 989.7701 990.5710 993.4142 996.4368 996.6570 1012.4458 1024.5507 1027.7911 1037.2238 1041.8221 1059.5915 1073.5609 1074.6769 1080.8726 1084.2543 1086.4560 1097.8141 1116.6656 1133.8905 1143.9279 1148.3203 1158.8503 1170.6125 1173.4491 1176.5472 1184.1736 1195.5667 1214.4355 1215.9913 1222.3875 1236.0769 1244.1415 1245.2575 1277.9328 1287.4473 1295.6907 1307.4888 1316.3579 1321.4093 1324.3680 1333.0799 1338.5723 1349.6201 1355.9235 1370.5548 1379.8036 1381.9043 1383.7357 1396.9962 1397.3768 1403.0440 1436.8863 1441.2605 1444.6025 1454.4241 1455.7736 1460.1592 1470.3335 1471.5891 1474.1739 1483.2059 1483.6873 1485.6393 1486.2253 1491.4689 1591.9491 1593.9801 1614.0376 1615.2388 1640.3649 2844.4408 2856.1185 2885.6620 2965.7844 2981.4411 2986.1474 2988.1074 2997.6785 3000.4177 3011.9285 3018.2136 3024.6978 3037.1006 3043.0339 3051.9627 3076.4682 3089.4579 3092.5354 3093.4003 3105.5645 3117.5225 3121.7584 3126.3948 3130.3572 3138.7117 3142.7826 3153.9206 3155.2437 3166.6702 3167.6116 3561.0040
redmass: 4.8219 3.3878 3.7594 3.8318 4.1304 3.5240 2.7038 5.3756 6.6042 4.1376 3.6427 4.3009 3.3109 2.5279 1.3598 2.0525 3.3699 2.4512 1.8421 3.3307 4.5992 3.5544 1.4606 2.1924 3.4458 4.3279 3.8412 2.9774 2.4057 2.4089 2.0879 2.7964 2.8399 4.1285 2.9493 3.5946 3.3781 2.9784 2.7827 3.4398 3.4244 3.6273 3.7168 6.4090 6.3528 4.3107 3.3539 4.5594 1.7173 1.8035 2.6049 2.9647 1.9803 1.9399 1.3596 3.0926 1.3419 2.2690 1.2620 2.6968 2.4730 2.1138 1.6403 1.4853 1.8237 2.2417 2.1589 1.8474 1.4461 2.6897 3.3896 4.4625 2.3052 1.3968 1.4361 1.8709 2.2569 2.0303 1.8513 1.9213 2.1074 2.0880 2.0201 1.9532 1.7287 1.9086 1.9928 2.5692 2.9019 1.9955 2.4162 1.5309 1.0589 1.0751 1.8227 1.1237 1.1315 1.3594 1.6141 1.7158 2.4083 1.1951 1.3141 1.4332 1.2806 1.1743 1.5593 1.4065 1.3594 1.3563 1.7687 1.3685 1.3385 1.5973 1.4848 3.4426 4.1834 1.5365 1.3720 1.2094 1.6990 2.2511 2.0095 1.0859 1.0901 1.1255 1.0816 1.0797 1.0407 1.0579 1.2407 1.1749 2.1990 1.5731 1.0563 6.0762 6.1616 6.0553 6.0547 9.4634 1.0717 1.0707 1.0687 1.0648 1.0843 1.0365 1.0638 1.0367 1.0839 1.0641 1.0900 1.0874 1.0872 1.0951 1.0952 1.0983 1.0987 1.1005 1.1001 1.1000 1.0846 1.0850 1.0881 1.0875 1.0936 1.0932 1.0970 1.0953 1.0982 1.1001 1.0658
irintensity: 0.1394 0.0783 0.0918 0.0268 0.7223 0.0604 0.7712 1.3322 3.0616 0.0506 0.6834 0.4885 2.6882 0.8861 0.9106 2.3443 1.1003 1.9977 1.2809 4.6995 1.5449 5.3559 69.0489 44.1122 2.0982 6.7019 8.1056 13.1741 5.1132 2.1855 2.9343 0.2619 0.5292 0.4817 1.7712 7.0544 3.5006 12.8832 3.4991 12.5023 8.3581 14.0100 2.9833 0.5320 0.1136 1.2688 2.7242 2.6390 53.0083 56.3078 18.4326 17.8058 58.3887 32.3542 14.1089 9.7072 2.3749 9.1664 2.1787 42.3540 12.3710 5.0020 6.4981 8.3605 1.8514 5.6304 45.4682 34.5515 0.3774 18.6287 7.2361 1.4146 7.1240 1.9985 3.9240 42.1166 4.1317 15.9280 6.7248 35.0628 119.0625 47.7906 21.2688 4.5043 5.6083 6.8302 4.4031 124.5867 143.9989 7.3886 39.6848 76.4967 0.8892 0.3772 5.3443 5.0690 3.4218 9.1127 13.4432 16.3014 1.6522 4.8501 1.8567 11.3099 8.7303 2.3277 15.3460 2.2043 5.3534 0.3593 51.0559 9.8033 19.0209 14.4931 5.6346 1.1527 3.7638 10.0388 11.3747 20.2160 10.8504 12.1051 13.2075 26.8917 16.8964 11.3388 3.6174 10.5228 12.0207 7.9625 8.3246 24.4728 10.1794 10.9059 13.6378 2.2802 0.3351 2.7940 3.1244 126.2891 52.9398 110.1541 105.3407 43.0772 26.4781 28.3022 15.0677 29.9147 24.9433 20.2077 26.7588 19.7937 47.0176 54.8914 5.7532 31.7436 8.0788 33.2201 35.0266 25.8079 0.9143 3.1825 4.4683 1.3545 33.1334 24.9658 27.2492 37.0167 14.4454 14.8936 7.2878
temp: 298.150 k
press: 1.00000 atm
elementType: 8 8 8 7 6 6 6 6 6 6 6 6 6 6 6 6 6 6 6 6 6 6 6 6 6 6 6 6 1 1 1 1 1 1 1 1 1 1 1 1 1 1 1 1 1 1 1 1 1 1 1 1 1 1 1 1 1 1 1
symmnumber: 1
zpe: 1306616.9 jmol-1
zpe.correction: 0.497664 hartree
zpe.thermalcorrener: 0.525361 hartree
zpe.thermalcorrenthalpy: 0.526305 hartree
zpe.thermalcorrgfe: 0.436558 hartree
zpe.sumelectzpe: -1211.468452 hartree
zpe.sumelectthermal: -1211.440755 hartree
zpe.sumelectthermalent: -1211.439811 hartree
zpe.sumelectthermalfe: -1211.529558 hartree
dipole: -1.7311 0.8646 -2.0753
dipole: 2.8375
quadrupole: -179.7533 -159.3208 -161.1541
quadrupole: 9.5322 1.0873 1.1082
quadrupole: -13.0106 7.4219 5.5886 9.5322 1.0873 1.1082
hfenergy: -1211.9661158 hartree
pointgroup: C01 [X(C24H31N1O3)]
dipole: -0.6682967 -0.2871903 0.8468581 debye
polarizability: 319.0034733|-18.4365023|252.1535194|11.2909819|12.1284288|229.0879835 unknown
InChI: InChI=1S/C24H31NO3/c1-3-23(27)28-24(21-12-8-5-9-13-21)15-17-25(18-19(24)2)16-14-22(26)20-10-6-4-7-11-20/h4-13,19,22,26H,3,14-18H2,1-2H3
charge 0 multiplicity 1
59 atoms
O  -2.462812 -0.962402 0.94786
O  4.465619 -1.232117 -2.482317
O  -3.843262 -1.837377 -0.737205
N  0.952914 -0.794819 0.18126
C  -1.866597 0.133361 0.057354
C  -0.818852 0.782005 1.021654
C  -1.139265 -0.50531 -1.145027
C  0.276062 -0.251392 1.389217
C  -0.029431 -1.475184 -0.700932
C  -2.997193 1.105181 -0.301284
C  -0.202435 2.076759 0.44372
C  2.097609 -1.665387 0.557859
C  3.035351 -2.012323 -0.616407
C  -3.836759 1.591339 0.735922
C  -3.217839 1.567146 -1.621111
C  3.630983 -0.777264 -1.347072
C  -3.448906 -1.819568 0.450005
C  -4.868169 2.513001 0.461337
C  -4.24791 2.493954 -1.898912
C  -3.975591 -2.701612 1.576234
C  4.526133 0.064064 -0.448897
C  -5.076806 2.972404 -0.860243
C  -4.716563 -3.948565 1.059054
C  3.986731 1.161497 0.266764
C  5.897537 -0.25641 -0.292232
C  4.802314 1.923172 1.134418
C  6.713912 0.506928 0.571832
C  6.169483 1.597152 1.29103
H  -1.359615 1.036837 1.954629
H  -1.863516 -1.026251 -1.792168
H  -0.671585 0.307594 -1.730766
H  1.040044 0.245586 2.017083
H  -0.182285 -1.069702 1.996729
H  0.490118 -1.848869 -1.601213
H  -0.48212 -2.36368 -0.189979
H  -0.978903 2.796321 0.132322
H  0.422343 2.564583 1.214391
H  0.446677 1.857119 -0.42173
H  1.74396 -2.619941 1.02773
H  2.681233 -1.12621 1.327103
H  2.499277 -2.638378 -1.360365
H  3.870868 -2.626859 -0.228855
H  -3.688388 1.232397 1.761013
H  -2.599564 1.198541 -2.445009
H  2.792762 -0.152252 -1.716682
H  -5.50904 2.872573 1.274419
H  -4.406228 2.836366 -2.927748
H  -3.134313 -2.966625 2.241817
H  -4.658246 -2.073941 2.184518
H  -5.876876 3.689002 -1.076813
H  3.930658 -1.855651 -3.036154
H  -4.030216 -4.62716 0.522863
H  -5.167519 -4.505288 1.899313
H  -5.515142 -3.660815 0.354982
H  2.927474 1.415396 0.137921
H  6.316276 -1.082272 -0.875642
H  4.375278 2.773517 1.678637
H  7.775959 0.257478 0.679266
H  6.805164 2.190556 1.958204
