program: Gaussian 09
title: 000297060
version: EM64L-G09RevD.01
frameworkgroup: C1[X(C22H31N3O)]
method: RPBEPBE
basis: SDD
operation: Freq
keyword: #p
keyword: freq=noraman
keyword: PBEPBE/SDD
title: #p freq=noraman PBEPBE/SDD
converged: YES YES NO NO
title: Mulliken charges:
elementType: O N N N C C C C C C C C C C C C C C C C C C C C C C H H H H H H H H H H H H H H H H H H H H H H H H H H H H H H H
charge: -0.274138 -0.069886 -0.400359 -0.405119 -0.225965 -0.172787 -0.513519 -0.170488 -0.611867 -0.464724 0.492461 -0.201979 0.370992 0.177319 -0.649473 0.227752 -0.508474 -0.444173 -0.034852 0.333087 -0.373126 -0.204457 -0.761843 -0.738964 -0.751945 -0.715248 0.228428 0.239225 0.261589 0.222744 0.211742 0.222093 0.240439 0.230441 0.205106 0.196163 0.223686 0.222594 0.232283 0.263469 0.252908 0.288858 0.300816 0.225461 0.212779 0.234249 0.206563 0.235322 0.218431 0.213500 0.212876 0.205082 0.215499 0.218836 0.227113 0.219012 0.204467
chargesum: 0.00000
title: Mulliken charges with hydrogens summed into heavy atoms:
elementType: O N N N C C C C C C C C C C C C C C C C C C C C C C
charge: -0.274138 -0.069886 -0.111501 -0.104303 0.002463 0.066438 -0.029186 0.041255 -0.149336 -0.029177 0.492461 -0.201979 0.370992 0.177319 -0.007030 0.227752 -0.276191 -0.180704 0.218056 0.333087 -0.147665 0.008322 -0.085708 -0.094156 -0.112528 -0.064657
polarizability: 3.15260919e+02 1.26230274e+01 2.59031209e+02 -2.68445576e+01 2.53085583e+01 2.06234460e+02
1716.lowfreq: -8.3429 -3.5001 -0.0007 -0.0001 0.0004 10.0265 17.2470 27.6730 36.9746
frequency: 17.0217 27.5737 36.2437 47.1400 62.4678 68.1650 89.0075 125.9480 140.3468 156.1509 177.9269 185.0522 188.0724 205.0101 218.6124 228.4205 232.1358 241.5177 256.6890 268.2879 272.0659 276.1287 294.1524 305.7121 322.4050 348.9389 355.7861 369.9688 375.3716 392.3394 419.2361 440.2718 448.9042 470.4413 479.4408 491.5681 508.4210 530.2934 542.1694 562.6007 578.0120 580.9344 600.7664 618.7208 635.8972 680.3336 703.2885 717.7579 734.3400 750.2579 757.7235 778.9340 794.3551 805.5093 834.5732 850.9671 876.7089 879.0318 896.2193 901.5388 918.0769 922.9515 927.4321 940.5494 948.6317 954.8526 968.1082 989.3812 991.3089 1014.8112 1033.2767 1037.0600 1049.0041 1055.9074 1065.3817 1084.0873 1093.6926 1097.8031 1101.8440 1108.2789 1121.1431 1127.6648 1136.0061 1167.7000 1172.6883 1182.1079 1192.7490 1211.5165 1216.3145 1219.7314 1228.5778 1236.6424 1253.0842 1255.1640 1259.1738 1275.6800 1289.3373 1305.2044 1309.1405 1311.0891 1317.9764 1329.8613 1332.3281 1342.7605 1344.2089 1359.0603 1370.0010 1371.6997 1373.3305 1388.2006 1403.5174 1405.8973 1417.9057 1432.2686 1451.5924 1456.7195 1458.2429 1460.5339 1464.2103 1464.6508 1470.0048 1476.9929 1477.8569 1480.3101 1483.3300 1488.2400 1490.8611 1493.7068 1497.0022 1501.6206 1563.7538 1605.2697 1617.6287 1628.8281 2870.3811 2898.2914 2967.4378 2970.2002 2971.2212 2971.8495 2978.2740 2979.2377 2983.3950 2988.4255 2991.8760 3007.0232 3012.5481 3014.6153 3031.3257 3053.4995 3058.7123 3064.1248 3065.7330 3066.3868 3071.5910 3075.1206 3076.0681 3082.2193 3096.3616 3115.6859 3131.9424 3153.5125 3218.4675 3537.6156 3612.7937
redmass: 4.8854 4.4205 3.2693 2.8792 4.1600 5.5107 3.4481 3.7707 3.3108 2.5166 2.3397 3.2084 1.0757 3.3530 1.7510 1.4692 1.2272 1.8642 1.0825 3.7245 2.6003 2.6103 2.2467 4.8145 2.9835 2.8640 2.3380 2.3285 2.8359 3.5481 3.2118 2.9673 3.5699 3.8892 2.6264 1.2629 2.5961 2.9633 3.2256 2.9779 3.6349 1.5026 3.1704 4.2633 2.8782 4.2145 4.6725 5.7040 4.4409 1.9567 2.1743 1.7294 2.9616 2.5632 5.0126 2.1351 2.2710 1.6933 1.9268 1.8908 2.5929 1.6830 1.6127 1.2360 1.4734 2.1504 2.1636 1.3590 2.4464 1.5851 2.1892 2.2462 2.2127 1.6465 2.5093 2.7586 2.2821 2.2709 1.7039 2.6030 2.3554 1.9424 1.7455 1.4773 1.3338 1.6186 1.7597 2.1560 1.6820 1.4164 2.9514 2.0025 2.6531 1.6845 1.4092 1.5822 1.9384 1.3509 1.4400 1.2972 1.6004 1.5208 1.3218 1.4943 2.2178 1.4625 1.4881 1.2175 1.2111 1.2148 1.2077 2.7659 3.3471 1.1621 2.2750 1.0543 1.4249 1.3792 1.0739 1.0928 1.1275 1.0947 1.0893 1.1387 1.0803 1.0549 1.0736 1.0697 1.0653 3.4140 6.7825 6.1920 7.2878 8.1059 1.0555 1.0681 1.0355 1.0775 1.0356 1.0750 1.0359 1.0755 1.0385 1.0838 1.0603 1.0745 1.0919 1.0834 1.0984 1.1025 1.0989 1.0994 1.0997 1.1003 1.0993 1.0983 1.0977 1.0991 1.0984 1.0865 1.0907 1.0982 1.0981 1.0769 1.0807
irintensity: 1.6434 0.8747 0.5476 0.6815 2.1036 2.5127 1.5316 5.9571 0.5534 0.4738 8.3415 2.3788 0.6242 7.6622 0.2644 0.3907 0.7758 2.6064 0.9445 0.9082 0.1946 3.6572 0.3032 10.5398 0.9365 4.5500 2.2214 0.6862 0.0802 2.5240 0.4901 6.7576 5.2614 2.8560 5.5356 96.2066 1.5067 8.3493 6.7423 9.4038 3.8369 76.5050 0.2046 1.7063 5.1932 9.2319 4.6866 1.1369 2.3933 27.8860 56.3987 33.5382 0.8748 0.7180 2.8652 5.0746 4.3497 1.4593 4.6493 1.2712 1.5849 2.4720 2.2263 0.1432 4.7685 6.0395 5.9746 3.7375 4.0059 2.2478 23.4567 8.1684 62.7033 15.8731 19.8335 2.6236 5.1007 7.0745 5.4249 19.3032 14.1137 35.8968 7.8028 32.3274 8.5996 43.6652 52.5143 11.3638 2.7926 8.2640 1.1130 3.6081 4.3522 27.1148 8.1394 13.0404 17.7055 3.5795 7.1368 0.2339 2.2252 23.5016 6.0766 34.3632 39.6507 10.5023 14.6633 24.5844 9.3565 33.6258 16.2051 6.5918 7.9039 7.3095 14.4411 4.1644 34.6215 172.7539 6.3425 17.9057 71.4423 14.9255 4.5417 68.6963 4.9877 3.8007 34.8782 16.3430 13.8708 1.5288 1.6755 117.6972 15.6051 8.5544 105.0380 43.1069 34.0084 8.6869 25.2901 37.3091 28.7397 29.4464 21.3159 39.0430 17.9565 56.7724 52.2536 5.3317 36.6775 25.8443 24.8828 7.4063 18.4861 40.8088 49.4884 104.5433 25.8872 36.6224 37.8507 6.9935 18.6619 38.4673 1.8435 11.7360 60.2108
temp: 298.150 k
press: 1.00000 atm
elementType: 8 7 7 7 6 6 6 6 6 6 6 6 6 6 6 6 6 6 6 6 6 6 6 6 6 6 1 1 1 1 1 1 1 1 1 1 1 1 1 1 1 1 1 1 1 1 1 1 1 1 1 1 1 1 1 1 1
symmnumber: 1
zpe: 1287560.7 jmol-1
zpe.correction: 0.490406 hartree
zpe.thermalcorrener: 0.515842 hartree
zpe.thermalcorrenthalpy: 0.516786 hartree
zpe.thermalcorrgfe: 0.435329 hartree
zpe.sumelectzpe: -1094.483430 hartree
zpe.sumelectthermal: -1094.457994 hartree
zpe.sumelectthermalent: -1094.457050 hartree
zpe.sumelectthermalfe: -1094.538507 hartree
dipole: -0.2346 -0.0718 -1.4277
dipole: 1.4486
quadrupole: -127.5297 -150.0356 -160.4536
quadrupole: -4.2974 -18.1391 2.3807
quadrupole: 18.4766 -4.0293 -14.4473 -4.2974 -18.1391 2.3807
hfenergy: -1094.9738362 hartree
pointgroup: C01 [X(C22H31N3O1)]
dipole: 0.0875774 -0.0512953 0.5608049 debye
polarizability: 315.977032|-10.7128196|260.8739596|-26.0905693|-23.3327518|203.6755972 unknown
InChI: InChI=1S/C22H31N3O/c1-13(22(2,3)4)24-21(26)15-9-17-16-7-6-8-18-20(16)14(11-23-18)10-19(17)25(5)12-15/h6-8,11,13,15,17,19,23-24H,9-10,12H2,1-5H3
charge 0 multiplicity 1
57 atoms
O  -2.229561 0.359219 -1.658155
N  0.42736 2.350245 1.172485
N  -3.333311 -0.513873 0.201877
N  5.374175 -0.086205 -1.429273
C  1.361606 0.059415 1.059583
C  1.659747 1.585077 0.851465
C  0.143242 -0.379155 0.198668
C  -1.100654 0.493122 0.520265
C  2.284431 1.922899 -0.559629
C  -0.750314 1.99354 0.352504
C  2.588119 -0.792973 0.761188
C  3.519838 -0.255909 -0.153084
C  3.467791 1.021182 -0.814186
C  -2.261008 0.118158 -0.409368
C  0.623923 3.804317 1.304356
C  4.710025 -0.941765 -0.539132
C  2.87879 -2.065308 1.291664
C  4.621649 1.103477 -1.590628
C  -4.505738 -1.032241 -0.537774
C  -5.801069 -0.174192 -0.267612
C  4.99853 -2.224255 -0.015337
C  4.06468 -2.763643 0.90003
C  -4.652232 -2.544459 -0.249691
C  -6.964199 -0.719237 -1.140581
C  -6.216428 -0.213531 1.227218
C  -5.518659 1.295766 -0.679515
H  1.076235 -0.056063 2.125142
H  2.417807 1.868998 1.609997
H  0.378946 -0.289514 -0.878501
H  -0.076136 -1.447195 0.38869
H  -1.382337 0.326428 1.580813
H  2.57274 2.990572 -0.584248
H  1.516345 1.783646 -1.34666
H  -0.616374 2.20015 -0.735857
H  -1.60119 2.613941 0.694785
H  0.802696 4.335997 0.337594
H  1.488175 4.000632 1.964898
H  -0.270946 4.2566 1.770957
H  2.199613 -2.531082 2.016346
H  4.977112 1.89637 -2.24665
H  -4.245669 -0.894647 -1.605253
H  -3.281756 -0.692011 1.206942
H  6.262432 -0.277974 -1.886426
H  5.899387 -2.783934 -0.290152
H  4.260598 -3.752993 1.329857
H  -5.469964 -2.988191 -0.841916
H  -4.858485 -2.744941 0.818767
H  -3.717268 -3.06648 -0.51934
H  -6.664195 -0.793247 -2.203298
H  -7.303433 -1.716737 -0.807553
H  -7.832719 -0.036868 -1.083837
H  -5.424903 0.202581 1.879743
H  -6.448721 -1.239668 1.567558
H  -7.122951 0.400183 1.384037
H  -5.212594 1.360138 -1.739543
H  -4.705786 1.732022 -0.071992
H  -6.424093 1.915416 -0.538042
