program: Gaussian 09
title: 000297022
version: EM64L-G09RevD.01
frameworkgroup: C1[X(C21H25NO3)]
method: RPBEPBE
basis: SDD
operation: Freq
keyword: #p
keyword: freq=noraman
keyword: PBEPBE/SDD
title: #p freq=noraman PBEPBE/SDD
converged: YES YES NO NO
title: Mulliken charges:
elementType: O O O N C C C C C C C C C C C C C C C C C C C C C H H H H H H H H H H H H H H H H H H H H H H H H H
charge: -0.472673 -0.246504 -0.272948 -0.088946 0.305339 -0.491102 -0.472286 -0.397091 -0.376621 -0.393079 -0.476700 0.506860 0.209460 0.449290 -0.447757 -0.365446 -0.230777 -0.238691 -0.449211 -0.380419 -0.245362 -0.503763 -0.222316 -0.230334 -0.247394 0.208958 0.211582 0.231989 0.202958 0.245694 0.205886 0.225314 0.203115 0.211567 0.193166 0.220382 0.356460 0.231598 0.253690 0.232124 0.264103 0.225705 0.225684 0.228368 0.238273 0.247260 0.243989 0.222991 0.222231 0.225383
chargesum: 0.00000
title: Mulliken charges with hydrogens summed into heavy atoms:
elementType: O O O N C C C C C C C C C C C C C C C C C C C C C
charge: -0.116213 -0.246504 -0.272948 -0.088946 0.305339 -0.070563 -0.037339 -0.151398 0.054580 0.021603 -0.063152 0.506860 0.209460 0.449290 -0.216159 -0.111756 -0.005071 -0.013007 -0.217087 -0.116316 -0.016994 0.225760 0.000674 -0.008103 -0.022010
polarizability: 2.89239694e+02 3.95831345e+01 2.05589640e+02 -6.79471876e+00 8.96257914e+00 2.13561754e+02
1716.lowfreq: -0.5115 -0.0006 -0.0004 -0.0002 3.7002 8.1157 20.9313 23.0437 29.2567
frequency: 18.9305 22.9356 29.1977 34.3210 42.1239 54.4022 79.3601 88.0987 94.2238 107.7662 150.9507 169.5492 184.0366 200.4033 216.3181 222.4686 246.4238 257.3976 275.5050 301.4785 318.7687 343.1323 346.9946 362.6171 401.1984 404.4039 406.2943 433.1385 463.0631 488.6668 496.4999 526.3659 580.2582 593.4173 605.5066 615.2030 617.0449 663.9059 687.4073 698.1503 705.5043 714.5443 739.2719 752.0845 781.4004 794.4557 803.1474 808.8532 838.8986 846.9792 860.4517 865.8436 912.9128 916.9540 933.4032 940.6204 951.8209 971.5234 977.0976 982.6735 989.8022 990.8273 994.3333 996.7013 1009.2647 1017.9238 1023.5797 1028.2644 1029.9128 1063.1806 1076.5218 1084.3159 1109.5900 1113.6231 1124.8301 1135.3076 1148.5924 1152.4901 1157.3125 1169.1189 1172.1438 1179.8958 1186.8147 1193.0742 1194.5658 1209.4500 1218.5089 1238.9449 1268.5315 1280.7964 1299.0485 1305.2507 1314.1553 1329.7725 1338.4778 1340.6863 1349.3128 1362.3255 1379.0458 1382.6046 1391.5246 1401.5818 1421.8052 1435.0068 1439.5309 1442.0704 1449.8316 1453.6471 1458.0322 1461.9124 1466.2650 1479.4190 1480.4298 1483.4488 1590.7957 1593.7261 1600.2738 1610.3515 1614.5811 2844.2928 2877.5506 2893.3777 2981.6624 2983.3432 2996.8125 3009.7694 3023.3067 3036.7207 3042.0583 3046.3447 3072.4381 3111.2217 3114.3618 3118.0403 3120.8045 3128.1924 3134.1598 3141.7577 3145.8580 3156.6744 3158.6395 3159.8480 3173.4278 3403.9051
redmass: 3.7927 5.0709 4.7671 3.8435 4.4257 4.9643 3.4322 1.6969 3.2251 2.3712 4.0714 4.2744 5.0332 3.5210 3.7376 3.3892 3.5447 3.8959 4.2867 5.4162 2.4659 3.4850 3.4278 3.1589 2.7754 2.2200 2.8515 2.5665 3.0701 3.5494 3.5188 4.0224 2.9717 1.4796 3.7401 4.9376 6.2842 3.3467 4.0225 1.9969 2.1951 2.9756 1.5986 3.0906 2.8549 3.0596 1.6895 3.9020 4.3559 1.2641 1.2490 5.6901 1.4273 1.5758 2.6506 3.0417 2.3790 1.4015 2.5461 1.3750 5.8691 5.6874 1.3399 1.3896 1.6595 1.9579 2.8286 2.2812 2.3114 2.1449 1.6142 1.6389 2.3262 1.2954 2.9309 2.6852 1.9805 1.8718 2.4384 1.0594 1.0636 1.1118 1.1086 1.3828 1.6804 2.1404 1.2993 1.3930 1.4144 1.6796 1.4576 1.5041 1.4025 1.4047 1.2938 1.3359 1.3721 1.4370 2.6989 6.2587 2.2557 1.5838 1.2020 1.1164 2.0834 2.0504 1.1094 1.0499 1.1001 1.0514 1.1131 1.3782 2.0715 1.6523 6.1855 6.1608 6.5497 6.4005 6.1338 1.0707 1.0703 1.0686 1.0607 1.0841 1.0636 1.0293 1.0889 1.0860 1.0902 1.0981 1.1000 1.0866 1.1049 1.0865 1.0863 1.0875 1.0916 1.0933 1.0953 1.1052 1.0978 1.1013 1.0970 1.0654
irintensity: 0.2565 0.0764 0.9073 0.0896 0.4492 0.2684 0.9957 1.1115 1.1966 0.0041 2.1051 3.0046 0.1895 2.3721 9.6060 1.6236 2.9062 1.4996 7.0524 5.7461 3.5266 6.3380 11.8176 13.5763 0.2952 2.7812 0.2895 6.6546 9.5640 10.5565 9.3095 1.3000 39.6430 179.2434 8.5157 12.5988 0.7450 31.7624 6.6694 36.6773 35.7152 31.4897 46.7579 31.5352 18.9708 17.4744 1.1478 1.8686 1.5888 0.2931 0.2314 0.7215 10.5596 2.9865 6.1213 4.4088 11.0029 0.1599 36.7705 0.2244 0.1019 1.6752 0.6366 2.2410 8.1864 2.9252 28.0771 1.7960 20.2105 34.1626 18.7773 20.6789 30.0566 3.7138 43.7991 167.2611 11.8204 101.7994 7.5102 0.4619 0.5104 1.9209 11.4487 2.4113 0.7444 2.4899 9.4431 9.7578 28.3304 53.8049 22.5191 50.3093 24.7282 10.1919 6.8570 23.7395 6.6331 0.9456 16.1970 0.7829 28.0655 35.5262 23.7611 7.3561 14.2310 8.5322 1.9447 15.2047 5.5471 10.8200 9.0552 9.9891 23.1365 12.6250 10.7556 0.7658 97.9370 17.4846 8.4267 69.9860 54.4071 88.1490 33.0784 12.1185 22.1506 30.8585 48.5524 5.1330 21.7063 35.1535 23.9411 8.1222 21.8789 6.2925 0.3433 1.6673 21.7339 30.6018 34.0975 12.5437 34.1150 28.7559 6.6306 96.6927
temp: 298.150 k
press: 1.00000 atm
elementType: 8 8 8 7 6 6 6 6 6 6 6 6 6 6 6 6 6 6 6 6 6 6 6 6 6 1 1 1 1 1 1 1 1 1 1 1 1 1 1 1 1 1 1 1 1 1 1 1 1 1
symmnumber: 1
zpe: 1088925.1 jmol-1
zpe.correction: 0.414750 hartree
zpe.thermalcorrener: 0.438119 hartree
zpe.thermalcorrenthalpy: 0.439063 hartree
zpe.thermalcorrgfe: 0.359200 hartree
zpe.sumelectzpe: -1093.801431 hartree
zpe.sumelectthermal: -1093.778062 hartree
zpe.sumelectthermalent: -1093.777117 hartree
zpe.sumelectthermalfe: -1093.856981 hartree
dipole: -1.5625 1.6238 1.5184
dipole: 2.7173
quadrupole: -138.8661 -136.3083 -145.6815
quadrupole: -0.8217 -6.0472 2.6225
quadrupole: 1.4192 3.9770 -5.3962 -0.8217 -6.0472 2.6225
hfenergy: -1094.2161808 hartree
pointgroup: C01 [X(C21H25N1O3)]
dipole: -0.6010163 0.5101112 0.7221376 debye
polarizability: 288.8419915|40.7233963|202.9217205|-0.7913258|5.8983629|216.6273756 unknown
InChI: InChI=1S/C21H25NO3/c1-25-20(23)19(18-10-6-3-7-11-18)21(24)12-14-22(15-13-21)16-17-8-4-2-5-9-17/h2-11,19,24H,12-16H2,1H3
charge 0 multiplicity 1
50 atoms
O  -1.136332 0.183477 -1.83708
O  -3.000223 2.511458 1.306691
O  -2.584671 2.396522 -0.972203
N  1.993564 -0.811032 -0.464234
C  -0.828178 0.071939 -0.39927
C  0.357547 1.011222 -0.037241
C  -0.411814 -1.395186 -0.170117
C  -2.089041 0.43791 0.479405
C  1.644845 0.599256 -0.77374
C  0.905225 -1.727839 -0.894086
C  3.306387 -1.200672 -1.030838
C  -3.271241 -0.53281 0.350927
C  -2.564152 1.855692 0.167994
C  4.486713 -0.521716 -0.340597
C  -3.679204 -1.281887 1.483403
C  -3.97076 -0.703918 -0.872398
C  -4.756065 -2.192454 1.399481
C  -5.048038 -1.613818 -0.955868
C  5.629791 -0.135255 -1.082573
C  4.478935 -0.312077 1.061905
C  -5.445226 -2.361602 0.176833
C  -3.559882 3.8742 1.103041
C  6.749709 0.439877 -0.438178
C  5.593459 0.266199 1.708173
C  6.735512 0.641964 0.96101
H  0.54118 0.965217 1.054046
H  0.10594 2.057662 -0.299411
H  -1.213736 -2.05953 -0.53681
H  -0.284407 -1.568742 0.915718
H  -1.768198 0.435365 1.53645
H  1.500412 0.743117 -1.873555
H  2.480831 1.246286 -0.453397
H  1.205844 -2.764674 -0.651349
H  0.732667 -1.668968 -1.996221
H  3.364429 -1.005072 -2.132817
H  3.400259 -2.298757 -0.903887
H  -1.530119 1.0914 -1.980218
H  -3.151515 -1.150582 2.436076
H  -3.661611 -0.141321 -1.757851
H  5.642682 -0.282315 -2.170237
H  3.58252 -0.598316 1.623512
H  -5.056608 -2.76491 2.284239
H  -5.577024 -1.740389 -1.907283
H  -6.282475 -3.065271 0.108352
H  -3.838676 4.212338 2.110153
H  -4.438844 3.823584 0.439517
H  -2.79951 4.533845 0.653488
H  7.626672 0.734348 -1.026261
H  5.57433 0.423672 2.79304
H  7.600899 1.090366 1.462364
