program: Gaussian 09
title: 000297007
version: EM64L-G09RevD.01
frameworkgroup: C1[X(C16H24O2)]
method: RPBEPBE
basis: SDD
operation: Freq
keyword: #pfreq=noraman
keyword: PBEPBE/SDD
title: #p freq=noraman PBEPBE/SDD
converged: YES YES NO NO
title: Mulliken charges:
elementType: O O C C C C C C C C C C C C C C C C H H H H H H H H H H H H H H H H H H H H H H H H
charge: -0.232843 -0.448929 -0.399769 -0.405710 -0.373945 -0.158639 -0.022992 0.121369 -0.739387 -0.714751 -0.717713 0.158812 -0.472173 0.180228 0.455409 -0.389450 -0.404653 -0.807067 0.176363 0.236623 0.183359 0.219591 0.181091 0.193626 0.263690 0.188656 0.223920 0.218453 0.236397 0.224682 0.205110 0.205765 0.206737 0.209537 0.210634 0.286298 0.212864 0.236310 0.219959 0.235577 0.235242 0.361718
chargesum: 0.00000
title: Mulliken charges with hydrogens summed into heavy atoms:
elementType: O O C C C C C C C C C C C C C C C C
charge: -0.232843 -0.087211 0.013217 -0.002760 0.000772 0.105051 0.165663 0.121369 -0.060618 -0.079194 -0.090804 0.158812 -0.185874 0.180228 0.455409 -0.176585 -0.168343 -0.116288
polarizability: 2.23200377e+02 -2.02103451e+01 1.74989586e+02 1.95194213e+01 1.72221094e+01 1.49306483e+02
1716.lowfreq: -32.1695 -14.1085 -4.4457 -0.0002 0.0001 0.0006 2.0406 9.5231 27.8393
frequency: -32.0459 8.6165 27.4223 34.2872 49.7363 92.7941 107.7591 119.9065 125.2230 149.7762 153.1464 186.6931 205.4790 208.8053 220.6596 237.8837 246.2720 295.1196 314.7196 329.3990 340.9951 376.8232 378.4520 385.8177 405.7432 438.3609 452.9528 467.7323 486.6307 535.0021 543.0565 639.3149 680.6596 692.9747 738.5879 743.3244 763.3392 802.2976 805.1453 840.5271 851.5258 909.2026 913.5455 921.7328 933.5104 950.3379 965.8375 978.1952 987.4108 1002.2543 1020.1806 1034.9923 1052.8053 1067.6567 1071.8227 1089.2123 1108.7922 1135.0412 1149.5014 1170.6464 1174.8308 1177.7962 1201.6073 1232.0231 1242.8334 1244.4543 1270.8647 1272.1593 1290.7724 1298.0438 1307.0029 1329.2634 1338.1970 1353.4944 1357.1481 1374.7374 1380.5723 1386.6030 1391.4487 1395.0851 1404.0188 1449.6457 1455.3546 1468.3921 1470.0727 1471.7235 1473.2242 1475.5106 1477.6964 1478.4017 1481.4142 1488.3208 1494.0715 1558.1503 1592.6265 1622.3606 2944.1836 2949.5189 2956.4517 2963.5449 2970.0412 2971.3305 2979.8866 2981.2853 2999.1662 3023.4466 3037.5160 3052.7243 3056.0969 3059.8570 3062.6795 3065.5145 3074.6194 3079.5960 3083.9603 3090.2683 3104.7196 3136.7132 3141.3240 3563.8312
redmass: 1.0250 4.3681 3.4239 3.3214 4.0685 3.0780 3.0699 3.9722 1.8718 3.9494 3.7865 2.4805 1.2790 1.6289 1.3487 1.2626 2.2462 2.8673 4.3222 3.2863 3.3691 2.6182 1.1845 4.0917 2.2480 3.3663 3.4800 3.7726 2.9645 3.9616 3.2334 3.6680 4.2555 3.1740 4.5654 1.3016 3.8897 1.4533 2.6256 1.4430 4.2238 1.9877 1.1945 1.3433 1.6646 1.3824 1.3551 1.7048 1.5921 3.1464 1.6964 1.8406 1.5498 3.0767 2.3730 2.2218 1.4987 1.9858 2.0415 1.2913 1.7539 1.9081 1.6249 4.3126 1.2887 2.0041 1.2563 1.3343 1.4318 1.1064 1.3308 1.4335 1.4804 1.5460 1.5833 1.2187 1.2587 5.8423 1.2167 1.8345 1.7459 1.0854 1.0727 1.0446 1.0451 1.0611 1.0782 1.1761 1.0699 1.0903 1.0534 1.0522 2.2401 8.1427 6.0465 6.8252 1.0628 1.0784 1.0660 1.0354 1.0366 1.0613 1.0370 1.0351 1.0971 1.0918 1.0877 1.1005 1.0994 1.0979 1.0994 1.0989 1.0985 1.1001 1.0990 1.0996 1.0883 1.0911 1.0956 1.0657
irintensity: 0.4174 0.8358 1.5016 0.4363 1.0595 0.5663 0.4845 0.0307 0.2850 0.9467 2.3832 0.8031 0.3436 1.0379 0.7657 0.0998 0.2949 3.0754 1.6063 2.8790 1.5187 2.5626 113.9802 4.6144 4.0434 2.3151 14.4829 0.9559 0.8899 8.6463 17.5052 4.5616 0.7010 1.2485 25.4360 3.0805 1.6491 47.0303 4.5801 5.4162 5.0043 6.8579 2.7819 1.8841 3.1461 1.0530 3.9784 33.5237 8.2256 2.0290 8.3925 12.6692 13.3695 4.5229 2.9544 148.4674 2.9134 31.4401 64.3373 14.0281 25.0105 34.1268 4.7685 29.5846 3.3269 20.8706 3.8084 7.9518 87.0444 6.4839 1.0054 3.7359 0.9167 9.0826 1.1620 23.2099 12.4899 16.6361 14.4637 39.8222 75.7820 10.8057 0.5994 3.0001 13.1748 4.2031 8.3182 9.6234 20.5757 17.2826 9.2471 25.0132 48.0344 111.9124 31.2618 20.6509 13.8851 14.8738 42.6344 44.6698 30.7055 44.7781 39.0565 40.3609 25.1618 1.8733 17.3580 24.7821 13.9829 18.4491 66.9032 93.0925 55.4885 34.4120 19.6367 38.6217 16.8958 1.8816 25.2848 35.2002
temp: 298.150 k
press: 1.00000 atm
elementType: 8 8 6 6 6 6 6 6 6 6 6 6 6 6 6 6 6 6 1 1 1 1 1 1 1 1 1 1 1 1 1 1 1 1 1 1 1 1 1 1 1 1
symmnumber: 1
zpe: 946089.6 jmol-1
zpe.correction: 0.360347 hartree
zpe.thermalcorrener: 0.380247 hartree
zpe.thermalcorrenthalpy: 0.381191 hartree
zpe.thermalcorrgfe: 0.309884 hartree
zpe.sumelectzpe: -773.158704 hartree
zpe.sumelectthermal: -773.138803 hartree
zpe.sumelectthermalent: -773.137859 hartree
zpe.sumelectthermalfe: -773.209166 hartree
dipole: 3.5205 1.5050 3.0054
dipole: 4.8674
quadrupole: -96.8239 -105.2200 -108.6252
quadrupole: -1.2874 6.3340 4.8531
quadrupole: 6.7325 -1.6636 -5.0689 -1.2874 6.3340 4.8531
hfenergy: -773.51905 hartree
pointgroup: C01 [X(C16H24O2)]
dipole: 1.1696419 -0.7262936 1.3310282 debye
polarizability: 225.9791093|-24.8218079|139.617743|-0.2686795|-3.5213847|181.8995937 unknown
InChI: InChI=1S/C16H24O2/c1-11(2)6-5-7-13(4)16(18)14-10-12(3)8-9-15(14)17/h8-11,13,17H,5-7H2,1-4H3
charge 0 multiplicity 1
42 atoms
O  0.294394 1.239247 -0.758683
O  1.294181 -0.262712 3.151539
C  -2.566317 0.044139 0.295268
C  -1.98372 1.348281 0.886278
C  -3.989479 0.23829 -0.275327
C  -0.579155 1.178741 1.510401
C  -4.668343 -1.058603 -0.793239
C  0.48934 0.888938 0.446326
C  -0.142655 2.465264 2.276856
C  -3.906779 -1.677625 -1.99054
C  -6.142018 -0.781142 -1.176173
C  1.813516 0.243318 0.803041
C  2.770261 0.165382 -0.248224
C  2.190575 -0.305835 2.065906
C  4.046492 -0.416629 -0.101911
C  3.465188 -0.899018 2.236458
C  4.381245 -0.952683 1.168589
C  5.024109 -0.466517 -1.263721
H  -2.592065 -0.740037 1.082256
H  -1.890218 -0.318953 -0.501159
H  -2.665896 1.730731 1.673711
H  -1.936772 2.117752 0.091799
H  -4.633188 0.683163 0.513378
H  -3.95351 0.978957 -1.102585
H  -0.588417 0.349193 2.238876
H  -4.661565 -1.797428 0.037784
H  -0.106895 3.331018 1.590135
H  -0.873896 2.686474 3.075239
H  0.848172 2.344523 2.747684
H  -2.876974 -1.970364 -1.718535
H  -4.425951 -2.579717 -2.365702
H  -3.841941 -0.951804 -2.824586
H  -6.197001 -0.047517 -2.004053
H  -6.652017 -1.704338 -1.510092
H  -6.70923 -0.367637 -0.320809
H  2.457364 0.588184 -1.210243
H  3.740895 -1.320663 3.212839
H  5.362984 -1.415053 1.324417
H  5.964869 -0.969128 -0.979945
H  4.596964 -1.01256 -2.125195
H  5.278955 0.549437 -1.618589
H  1.697197 -0.69587 3.945432
