program: Gaussian 09
title: 000297015
version: EM64L-G09RevD.01
frameworkgroup: C1[X(C23H24FN3O2)]
method: RPBEPBE
basis: SDD
operation: Freq
keyword: #p
keyword: freq=noraman
keyword: PBEPBE/SDD
title: #p freq=noraman PBEPBE/SDD
converged: YES YES NO NO
title: Mulliken charges:
elementType: F O O N N N C C C C C C C C C C C C C C C C C C C C C C C H H H H H H H H H H H H H H H H H H H H H H H H
charge: -0.201569 -0.263772 -0.305162 -0.269730 -0.138968 -0.130266 0.275262 -0.459406 -0.461972 0.117370 -0.423008 -0.426949 -0.342129 0.402794 -0.632924 0.224598 -0.368194 -0.339567 -0.323242 -0.237995 -0.260847 -0.265187 -0.272999 0.496279 -0.344630 -0.364074 -0.376227 -0.380139 0.320761 0.219069 0.249725 0.258265 0.218128 0.277285 0.196372 0.264791 0.262099 0.231811 0.233286 0.230842 0.277175 0.231332 0.230297 0.230441 0.200975 0.221274 0.226129 0.229199 0.273990 0.229761 0.245149 0.255964 0.258531
chargesum: 0.00000
title: Mulliken charges with hydrogens summed into heavy atoms:
elementType: F O O N N N C C C C C C C C C C C C C C C C C C C C C C C
charge: -0.201569 -0.263772 -0.305162 -0.269730 -0.138968 -0.130266 0.275262 0.009387 0.014421 0.117370 0.050649 0.099940 0.122968 0.402794 0.106426 0.224598 -0.137897 -0.109126 -0.122267 -0.016721 -0.034718 -0.035988 0.000991 0.496279 -0.114869 -0.118925 -0.120263 -0.121607 0.320761
polarizability: 4.22317936e+02 -3.42985874e+01 2.58548312e+02 -6.93539759e+00 8.62749176e+00 2.12097029e+02
1716.lowfreq: -3.6785 -1.9198 -0.0008 -0.0006 -0.0003 4.3303 10.1980 14.3955 32.1519
frequency: 9.9468 14.2670 32.1416 35.4010 51.6707 62.2644 75.7945 81.1715 85.6728 116.6322 128.7055 138.0154 138.3514 154.0384 199.2496 209.2348 213.0350 222.2878 238.1859 268.7213 275.3884 277.7817 302.4340 326.9132 347.4076 367.0240 369.7196 381.0045 397.3601 411.9500 413.7680 420.0917 454.2881 478.4616 504.1759 508.8467 514.2217 538.9326 568.1075 592.6830 614.0675 618.4079 630.6012 641.4939 668.0301 695.8588 712.8527 716.7971 729.8338 731.6081 750.7450 796.6884 799.0497 812.7583 813.7645 814.7413 831.3137 863.3543 869.6665 873.1929 905.2384 932.1461 946.3596 955.2634 957.7970 958.3702 974.0413 978.2896 979.3671 981.1735 1003.2093 1010.7522 1017.0186 1028.8639 1033.3860 1054.7043 1075.0277 1086.6726 1093.2846 1105.0823 1109.5794 1121.5611 1131.0237 1157.3512 1171.4714 1177.8981 1182.2951 1184.6243 1197.5320 1200.9231 1206.8692 1210.9695 1222.4823 1259.8370 1275.7646 1283.3150 1288.6896 1299.2464 1304.0340 1314.4199 1326.2422 1332.4654 1343.6611 1346.5407 1362.6729 1371.9246 1377.8135 1378.9448 1413.2068 1414.1162 1422.7047 1432.6992 1450.2656 1456.7607 1460.6520 1473.7065 1477.7481 1481.9597 1488.7869 1496.4804 1499.1268 1522.1914 1539.8266 1577.9766 1590.0569 1609.7316 1621.5263 1637.5498 1644.9071 2895.3761 2922.8530 2972.7992 3006.0510 3008.8750 3014.7359 3015.8650 3050.8810 3075.9857 3077.5113 3100.8090 3102.5842 3104.5951 3105.5733 3125.1872 3133.4115 3140.7543 3144.4403 3150.8157 3153.5671 3166.2491 3175.0087 3178.3876 3184.4841
redmass: 5.0541 4.8556 5.1389 6.9641 4.3362 5.6064 5.2076 3.6116 7.7960 4.5336 3.7687 2.3764 1.2195 2.9330 5.4473 5.5025 2.9276 4.1843 4.3727 3.6368 4.0882 3.5185 3.5933 4.7374 3.2380 5.3446 4.5687 6.2955 3.8125 2.3351 2.9071 2.9852 3.1240 4.8488 3.4507 4.0597 2.8951 4.2718 2.7381 4.4825 5.2096 5.5069 7.0289 4.2965 4.4180 1.8376 7.0530 5.2269 4.0336 5.0561 1.8789 1.7795 3.8131 2.2298 1.2743 1.6246 1.6337 4.1576 1.8961 1.4228 3.9618 2.5746 1.3597 2.3275 1.3945 1.3929 4.1369 2.8306 1.3417 3.8619 2.7695 1.2715 1.5827 2.7015 2.2740 2.3239 1.4181 2.1038 1.8369 1.3455 4.7116 1.2464 2.6980 1.4760 1.4393 1.5090 1.1661 1.8292 1.8079 1.6528 1.1427 2.0782 1.6982 1.5795 1.8945 2.5433 2.0072 1.6263 2.2097 1.3912 1.2785 1.6203 1.4331 1.2624 1.5998 1.8819 5.4192 4.6032 3.0482 1.7536 2.3746 1.4602 2.5493 1.1389 1.0852 1.1248 1.0443 1.1467 1.1782 2.6588 2.3874 1.1310 6.2263 5.9489 7.3526 6.2978 6.0927 7.9053 5.8715 1.0545 1.1074 1.0348 1.0629 1.0634 1.0671 1.0646 1.1020 1.0977 1.0976 1.1009 1.0896 1.0983 1.0972 1.0849 1.0891 1.0902 1.0891 1.0882 1.0922 1.0981 1.0959 1.0964 1.0942
irintensity: 0.0977 0.1171 0.8713 0.5672 1.2152 2.8476 0.6245 0.1733 3.7223 3.4283 2.0397 0.4250 0.1313 0.2738 0.0233 0.0773 1.8921 2.2288 6.5822 1.6697 0.4693 0.7149 7.3174 3.8323 13.7955 3.7512 1.6609 24.6223 9.3109 6.1514 0.5192 0.0106 2.8051 6.3608 25.6279 35.6978 7.4327 10.4103 6.3766 6.3790 1.6373 2.7948 0.1575 2.0078 1.0827 38.0864 1.9394 1.5149 0.3698 2.3913 80.2884 1.2888 14.7290 7.4512 0.0851 1.9222 98.6284 7.1342 1.6586 4.0851 4.5742 4.5163 3.3373 14.2147 1.0162 0.5918 11.9297 54.3203 0.1604 15.9481 6.8133 31.7416 10.4063 12.9989 9.6416 53.5682 2.2282 12.7606 0.7716 12.7586 2.2813 0.6659 143.3821 77.8492 0.4188 3.4198 4.5967 4.7087 10.6866 19.7819 7.7982 214.2361 6.9581 27.0873 27.0420 126.1688 3.1996 20.7978 9.0601 4.6732 4.0913 45.2233 4.7085 3.6064 94.8120 110.9627 19.4616 12.4723 30.4481 54.0849 195.0543 102.8622 2.0603 55.3754 4.0065 6.0310 19.1116 27.8345 16.8531 159.1950 158.9431 6.6898 155.9855 11.9263 5.5403 51.1742 156.2048 327.1011 91.8875 92.3303 44.1101 81.3668 22.3287 21.1320 22.7294 20.6226 29.1022 6.8235 34.9343 7.5104 0.2251 1.5647 17.5099 8.2496 8.2316 4.4414 13.8757 19.0021 34.5293 31.3712 5.3096 5.3330 10.0970
temp: 298.150 k
press: 1.00000 atm
elementType: 9 8 8 7 7 7 6 6 6 6 6 6 6 6 6 6 6 6 6 6 6 6 6 6 6 6 6 6 6 1 1 1 1 1 1 1 1 1 1 1 1 1 1 1 1 1 1 1 1 1 1 1 1
symmnumber: 1
zpe: 1117582.2 jmol-1
zpe.correction: 0.425665 hartree
zpe.thermalcorrener: 0.451694 hartree
zpe.thermalcorrenthalpy: 0.452639 hartree
zpe.thermalcorrgfe: 0.366495 hartree
zpe.sumelectzpe: -1303.305662 hartree
zpe.sumelectthermal: -1303.279632 hartree
zpe.sumelectthermalent: -1303.278688 hartree
zpe.sumelectthermalfe: -1303.364831 hartree
dipole: 5.2877 0.7499 -3.4272
dipole: 6.3457
quadrupole: -151.4439 -180.0686 -173.2562
quadrupole: -2.3744 -10.5940 6.9316
quadrupole: 16.8124 -11.8124 -5.0000 -2.3744 -10.5940 6.9316
hfenergy: -1303.7313265 hartree
pointgroup: C01 [X(C23H24F1N3O2)]
dipole: 2.0833539 -0.4581518 1.2972176 debye
polarizability: 422.389874|33.178471|255.7432061|10.5776254|13.9188836|214.830198 unknown
InChI: InChI=1S/C23H24FN3O2/c1-25-17-27(20-5-3-2-4-6-20)23(22(25)29)13-15-26(16-14-23)21(28)12-9-18-7-10-19(24)11-8-18/h2-12H,13-17H2,1H3
charge 0 multiplicity 1
53 atoms
F  -8.455132 -0.973819 1.519557
O  3.118253 3.142769 0.885963
O  -1.333441 1.416089 -2.449177
N  3.591262 -0.37154 0.263422
N  4.751081 1.458622 1.041909
N  -0.032297 1.786575 -0.556437
C  2.641688 0.775606 0.17264
C  1.389315 0.589946 1.095084
C  2.239276 1.105976 -1.30509
C  3.495648 1.94404 0.732242
C  0.323773 1.694543 0.873546
C  1.121001 2.171908 -1.399952
C  4.911642 0.030184 0.776903
C  3.373046 -1.708111 -0.113916
C  5.828935 2.278252 1.58907
C  -1.228037 1.408455 -1.173371
C  4.429649 -2.662256 0.034199
C  2.131348 -2.179548 -0.644691
C  -2.381856 1.018615 -0.308321
C  4.247521 -4.012663 -0.326255
C  1.966325 -3.532655 -0.999949
C  3.015726 -4.467352 -0.84642
C  -3.554953 0.631685 -0.89428
C  -4.799866 0.223963 -0.227877
C  -4.954476 0.175991 1.189694
C  -5.91462 -0.143001 -1.036944
C  -6.168866 -0.222034 1.778632
C  -7.140364 -0.544621 -0.468039
C  -7.238256 -0.574893 0.933005
H  1.71693 0.598194 2.152056
H  0.934579 -0.396765 0.903941
H  1.900531 0.185455 -1.809142
H  3.134745 1.460821 -1.849525
H  0.735277 2.6698 1.192488
H  -0.560013 1.479633 1.491593
H  0.764159 2.258795 -2.438186
H  1.498802 3.149957 -1.050627
H  5.181951 -0.517377 1.70857
H  5.722082 -0.147829 0.033163
H  6.137518 1.918512 2.58889
H  5.449256 3.308989 1.679522
H  6.710936 2.275672 0.921238
H  5.403075 -2.358249 0.431136
H  1.287274 -1.503398 -0.792901
H  -2.286579 1.057445 0.781103
H  5.081332 -4.712777 -0.198183
H  1.000446 -3.854681 -1.405849
H  2.877618 -5.516306 -1.126561
H  -3.556355 0.632227 -1.994121
H  -4.119462 0.452973 1.841416
H  -5.813975 -0.110718 -2.127736
H  -6.297283 -0.261416 2.864191
H  -7.997969 -0.826488 -1.085226
