program: Gaussian 09
title: 000026749
version: EM64L-G09RevD.01
frameworkgroup: C1[X(C10H12ClNO3)]
method: RPBEPBE
basis: SDD
operation: Freq
keyword: #p
keyword: freq=noraman
keyword: PBEPBE/SDD
title: #p freq=noraman PBEPBE/SDD
converged: NO YES NO NO
title: Mulliken charges:
elementType: Cl O O O N C C C C C C C C C C H H H H H H H H H H H H
charge: -0.048862 -0.346246 -0.218433 -0.166095 0.016772 0.113488 0.621192 -0.692084 -0.692089 -0.741655 -0.583459 -0.409710 0.271423 -0.289250 0.228907 0.222851 0.215164 0.226084 0.226088 0.215163 0.222851 0.229680 0.217248 0.217248 0.296334 0.281918 0.365473
chargesum: 0.00000
title: Mulliken charges with hydrogens summed into heavy atoms:
elementType: Cl O O O N C C C C C C C C C C
charge: -0.048862 0.019227 -0.218433 -0.166095 0.016772 0.113488 0.621192 -0.027985 -0.027987 -0.077480 -0.287124 -0.127792 0.271423 -0.289250 0.228907
polarizability: 1.80701492e+02 5.29198660e+00 1.68800751e+02 3.58964198e-03 2.35305970e-03 7.65981373e+01
1716.lowfreq: -17.6270 -14.1363 -0.0007 0.0010 0.0018 3.8467 7.2742 25.1241 84.3674
frequency: -17.6118 21.9348 84.3645 96.3858 133.9046 179.2793 198.8290 205.5256 255.2102 256.1370 264.2930 302.4884 309.5071 313.9065 340.1563 352.4195 374.0654 390.6100 428.7910 462.9638 479.9877 507.2494 507.4259 605.7772 616.5542 685.0027 689.9746 709.9776 725.5866 798.6077 816.7583 897.4041 900.1809 922.8409 935.7455 942.1258 953.7984 1021.5798 1026.9644 1068.5911 1138.4463 1146.4134 1189.9208 1205.8863 1217.2374 1245.9499 1263.8376 1296.6742 1356.5075 1379.6026 1381.5384 1387.3093 1407.3998 1410.2730 1460.5573 1465.6266 1465.8824 1478.1196 1482.6262 1490.2266 1498.1683 1566.3649 1615.3506 2974.7065 2977.1619 2981.3547 3069.2816 3074.2081 3075.3247 3080.1268 3082.5587 3084.1151 3174.3713 3180.9338 3436.5533
redmass: 14.5390 3.0371 8.1785 4.5595 4.8307 12.2405 3.0183 1.2964 3.0894 1.1539 2.9086 3.3765 1.0641 5.6734 11.1235 2.6287 3.4902 9.1348 3.4851 4.4933 4.2502 2.7990 1.1553 5.0187 5.3845 4.2735 9.2493 7.5952 7.3307 8.1232 3.5933 1.5321 4.1301 1.6920 1.6626 1.2344 1.3519 1.3936 1.3828 2.9346 2.4911 1.6853 10.0748 2.9890 2.9649 1.8402 2.5557 2.2572 5.3537 1.1815 1.2866 4.4271 3.2524 1.3641 1.0497 1.0479 1.2058 1.9392 1.2124 1.0494 1.1071 5.9794 8.2350 1.0356 1.0348 1.0360 1.1007 1.1004 1.0997 1.1000 1.0991 1.0988 1.0903 1.0918 1.0643
irintensity: 0.0255 0.1623 0.7761 0.1818 0.8497 2.2564 0.0044 0.0514 0.1211 0.0136 0.1534 0.2154 0.0047 4.3259 1.1582 0.0144 2.1685 5.6189 0.6676 0.7581 2.6630 2.6210 135.2030 10.3718 9.7546 3.3510 25.2278 59.5750 6.0567 4.3319 44.3800 14.5835 12.5151 3.5119 1.4523 1.1370 8.6597 1.6380 0.1995 46.1442 10.0094 69.0348 291.1241 5.4607 25.6234 49.5971 112.3434 24.5257 15.1145 19.0066 33.1242 147.0747 4.1142 3.1837 0.0143 0.9643 21.8331 102.3686 29.1441 13.5263 53.8915 10.8038 4.1818 26.8318 30.5909 19.0898 13.7083 12.9730 4.8291 25.3800 66.4373 80.2892 4.1878 0.3510 80.0341
temp: 298.150 k
press: 1.00000 atm
elementType: 17 8 8 8 7 6 6 6 6 6 6 6 6 6 6 1 1 1 1 1 1 1 1 1 1 1 1
symmnumber: 1
zpe: 535469.6 jmol-1
zpe.correction: 0.203950 hartree
zpe.thermalcorrener: 0.218333 hartree
zpe.thermalcorrenthalpy: 0.219277 hartree
zpe.thermalcorrgfe: 0.162521 hartree
zpe.sumelectzpe: -1127.529454 hartree
zpe.sumelectthermal: -1127.515070 hartree
zpe.sumelectthermalent: -1127.514126 hartree
zpe.sumelectthermalfe: -1127.570883 hartree
dipole: -4.4673 4.3918 0.0003
dipole: 6.2646
quadrupole: -95.2670 -106.4485 -95.5912
quadrupole: 11.9384 -0.0011 -0.0023
quadrupole: 3.8352 -7.3463 3.5110 11.9384 -0.0011 -0.0023
hfenergy: -1127.7334038 hartree
pointgroup: C01 [X(C10H12Cl1N1O3)]
dipole: -2.0820662 -1.3189464 0.0013073 debye
polarizability: 177.9945792|-7.2727012|171.5076043|-0.0141656|-0.0730058|76.5981972 unknown
InChI: InChI=1S/C10H12ClNO3/c1-10(2,3)6-4-7(11)9(13)8(5-6)12(14)15/h4-5,13H,1-3H3
charge 0 multiplicity 1
27 atoms
Cl 0.930262 -3.608763 0.002757
O  2.894649 -1.312263 0.000432
O  1.762883 2.785101 -0.002173
O  3.463825 1.273087 -0.002053
N  2.212479 1.567781 -0.001909
C  -2.675308 0.407471 -0.000034
C  -1.206828 -0.073426 0.000141
C  -2.931493 1.27057 -1.272456
C  -2.931129 1.272731 1.270982
C  -3.676353 -0.775156 0.001135
C  -0.152087 0.865674 -0.000812
C  -0.852683 -1.44823 0.00122
C  1.204994 0.47576 -0.000758
C  0.494276 -1.824834 0.001291
C  1.576104 -0.903161 0.00031
H  -2.772804 0.67819 -2.192048
H  -3.973704 1.639738 -1.274441
H  -2.263475 2.148975 -1.314905
H  -2.263106 2.151215 1.311785
H  -3.973338 1.641912 1.272618
H  -2.772203 0.681918 2.191541
H  -4.708367 -0.381758 0.000946
H  -3.564117 -1.410807 -0.896875
H  -3.563837 -1.409226 0.900223
H  -0.345437 1.941551 -0.001646
H  -1.620686 -2.224984 0.002016
H  2.931482 -2.310066 0.001317
