program: Gaussian 09
title: 000296962
version: EM64L-G09RevD.01
frameworkgroup: C1[X(C15H15N3O2)]
method: RPBEPBE
basis: SDD
operation: Freq
keyword: #p
keyword: freq=noraman
keyword: PBEPBE/SDD
title: #p freq=noraman PBEPBE/SDD
converged: NO YES NO NO
title: Mulliken charges:
elementType: O O N N N C C C C C C C C C C C C C C C H H H H H H H H H H H H H H H
charge: -0.182481 -0.229036 -0.298243 -0.376904 -0.324058 0.207698 0.144382 -0.587151 -0.233949 -0.220501 -0.465578 -0.435576 0.001658 0.162243 0.497548 -0.332821 -0.346046 -0.231367 -0.246494 -0.252744 0.259426 0.233584 0.238198 0.229918 0.223987 0.228747 0.229630 0.261911 0.318334 0.325218 0.249117 0.273302 0.223456 0.226101 0.228492
chargesum: 0.00000
title: Mulliken charges with hydrogens summed into heavy atoms:
elementType: O O N N N C C C C C C C C C C C C C C C
charge: -0.182481 -0.229036 0.020090 -0.051686 -0.324058 0.207698 0.144382 -0.094140 0.004248 0.009417 -0.012845 0.055965 0.001658 0.162243 0.497548 -0.083703 -0.072743 -0.007911 -0.020394 -0.024252
polarizability: 2.19324993e+02 2.90330691e+00 1.69901068e+02 -1.38224836e+01 5.92414756e+00 1.42360174e+02
1716.lowfreq: -12.3910 -9.0971 -4.3635 -0.0002 0.0004 0.0007 35.9579 61.7767 65.4736
frequency: 35.8982 61.6899 65.3739 87.1070 127.0971 152.9435 160.9127 177.9250 181.0310 210.1647 273.5974 301.9146 332.3514 350.9682 368.6237 394.9130 405.6885 435.1753 474.3113 486.0596 497.3902 526.9137 534.1681 561.0919 600.3096 615.3656 621.2678 664.6967 687.4121 695.9857 713.3525 733.5363 742.2179 751.0644 762.7368 807.1905 824.7906 848.0763 857.6279 895.4525 939.2046 949.1632 959.9888 965.2004 982.6641 987.5688 991.1171 1010.8880 1030.9920 1033.6145 1040.5413 1057.9395 1075.1197 1085.6825 1108.0885 1135.7394 1174.6067 1176.0483 1181.0760 1198.0496 1202.3070 1204.8109 1238.5759 1262.5183 1274.6143 1287.1551 1324.0634 1333.4186 1340.1808 1359.1153 1374.4267 1382.7933 1419.9792 1432.3430 1445.9852 1459.4493 1481.1089 1485.0136 1486.0723 1591.2083 1603.3368 1611.3542 1625.0200 1813.4935 2990.6186 3004.3105 3018.1704 3034.1791 3042.3629 3050.6440 3075.9440 3128.6597 3137.1563 3138.0378 3156.6970 3166.5662 3175.4529 3465.4563 3533.5852
redmass: 5.1083 5.4734 5.0161 7.1391 4.8716 4.8628 4.6024 4.4875 5.0588 2.7214 6.8553 5.0200 4.7553 4.7009 3.5601 3.4318 2.8675 5.9835 4.7367 3.9217 4.5688 3.1165 3.5458 3.0483 2.2162 5.8291 4.4823 4.1433 2.0486 2.7239 4.3784 4.3746 3.4382 2.5565 2.0034 2.3956 1.2759 3.0158 3.0822 1.4426 5.1228 2.6475 1.4170 1.5077 1.5119 3.7844 2.6990 3.3616 1.4540 2.0605 2.4749 3.1751 1.3109 2.6406 1.9666 2.0020 1.0622 1.6672 1.2664 1.6438 1.1584 2.5861 4.1722 2.4131 1.6074 1.6226 1.3743 1.3179 1.4079 1.5318 1.8619 7.0140 1.4752 1.5149 2.3800 1.1078 1.0866 1.2313 1.7748 6.1621 5.1623 5.6680 5.7392 10.4930 1.0613 1.0799 1.0680 1.0862 1.0527 1.1019 1.1019 1.0848 1.1161 1.0894 1.0935 1.0958 1.0990 1.0740 1.0761
irintensity: 0.9352 2.0750 3.2069 3.7606 0.1264 2.7939 2.6400 1.4414 0.5195 1.5194 4.9465 0.3899 4.8854 6.2364 2.5461 6.2684 0.5530 3.5927 12.7679 2.7033 1.7282 1.7258 5.2813 47.4945 60.5504 3.2942 34.2320 19.0600 49.1094 28.6128 0.4195 24.9998 24.9281 31.9093 62.3803 9.8724 1.0170 11.3049 6.9357 1.4528 1.8068 5.1787 0.5910 4.8847 0.0154 0.1028 2.9803 3.7749 3.5162 9.1104 13.3445 10.6285 14.5428 24.9470 35.7295 3.1922 0.4430 11.9051 14.4655 77.0549 0.8384 58.8783 114.2012 269.2476 115.0839 26.2359 9.5666 7.7862 12.7558 71.5672 209.4650 10.8235 28.0700 35.7504 3.1720 7.3980 7.5371 56.2618 33.9340 25.3778 228.2816 34.9753 358.5622 12.7835 25.2749 18.4433 56.9323 50.4374 50.6430 11.6641 30.9808 1.7504 18.5491 13.9827 36.3162 14.8858 2.6688 14.0489 37.7107
temp: 298.150 k
press: 1.00000 atm
elementType: 8 8 7 7 7 6 6 6 6 6 6 6 6 6 6 6 6 6 6 6 1 1 1 1 1 1 1 1 1 1 1 1 1 1 1
symmnumber: 1
zpe: 725319.0 jmol-1
zpe.correction: 0.276259 hartree
zpe.thermalcorrener: 0.292610 hartree
zpe.thermalcorrenthalpy: 0.293554 hartree
zpe.thermalcorrgfe: 0.232708 hartree
zpe.sumelectzpe: -893.752260 hartree
zpe.sumelectthermal: -893.735910 hartree
zpe.sumelectthermalent: -893.734966 hartree
zpe.sumelectthermalfe: -893.795812 hartree
dipole: 4.4276 -2.4245 3.8874
dipole: 6.3713
quadrupole: -99.4883 -108.7069 -129.3530
quadrupole: 4.6116 -4.4323 5.2775
quadrupole: 13.0278 3.8092 -16.8370 4.6116 -4.4323 5.2775
hfenergy: -894.0285196 hartree
pointgroup: C01 [X(C15H15N3O2)]
dipole: 1.9268765 -1.5467937 -0.4218832 debye
polarizability: 214.667657|22.8810691|146.2852991|-4.2445807|3.5347566|170.6332785 unknown
InChI: InChI=1S/C15H15N3O2/c19-14-16-12-6-7-13(11-8-10(11)12)17-15(20)18(14)9-4-2-1-3-5-9/h1-5,12-13,16-17H,6-8H2
charge 0 multiplicity 1
35 atoms
O  0.340356 2.01506 -1.701567
O  -0.675427 1.987172 1.96122
N  0.998563 -0.202556 -1.864797
N  1.523188 1.402874 1.531441
N  -0.216074 0.56853 0.09978
C  1.704376 -1.663353 0.065678
C  2.023696 -0.995918 1.164888
C  0.983711 -2.134187 1.353003
C  1.986738 -1.203374 -1.328627
C  2.590521 0.389961 1.247614
C  3.37742 -0.487696 -1.172353
C  3.352801 0.671085 -0.118881
C  0.417484 0.866303 -1.184944
C  0.155233 1.368947 1.240079
C  -1.534606 -0.027892 0.044586
C  -2.183513 -0.230007 -1.200019
C  -2.186965 -0.436892 1.238629
C  -3.447934 -0.854923 -1.249697
C  -3.45579 -1.046911 1.17728
C  -4.094369 -1.269654 -0.064743
H  -0.079092 -1.898771 1.500121
H  1.308016 -3.07002 1.826951
H  2.038034 -2.019071 -2.071242
H  3.299246 0.495001 2.08984
H  3.695094 -0.064296 -2.145609
H  4.121716 -1.253955 -0.887179
H  4.400077 0.944978 0.104068
H  2.889838 1.566421 -0.569037
H  1.223139 0.069915 -2.830778
H  1.725894 2.068865 2.281473
H  -1.715959 0.104976 -2.130238
H  -1.726299 -0.245407 2.211225
H  -3.932425 -1.002118 -2.221453
H  -3.947305 -1.346135 2.109685
H  -5.079583 -1.745855 -0.105797
