program: Gaussian 09
title: 000296942
version: EM64L-G09RevD.01
frameworkgroup: C1[X(C8H14N2O)]
method: RPBEPBE
basis: SDD
operation: Freq
keyword: #p
keyword: freq=noraman
keyword: PBEPBE/SDD
title: #p freq=noraman PBEPBE/SDD
converged: YES YES NO NO
title: Mulliken charges:
elementType: O N N C C C C C C C C H H H H H H H H H H H H H H
charge: -0.266539 -0.382712 -0.505491 -0.191849 -0.119970 -0.509267 -0.187102 -0.518619 -0.478113 -0.451871 0.180433 0.247146 0.235151 0.218314 0.265964 0.208124 0.199432 0.269064 0.203224 0.229188 0.227217 0.201296 0.318732 0.304205 0.304045
chargesum: 0.00000
title: Mulliken charges with hydrogens summed into heavy atoms:
elementType: O N N C C C C C C C C
charge: -0.266539 -0.063980 0.102759 0.055297 0.115180 -0.024989 0.021022 -0.050122 -0.045701 -0.023359 0.180433
polarizability: 1.16713917e+02 7.13806713e-01 9.11031026e+01 1.35878603e+00 -1.97302470e+00 8.17468733e+01
1716.lowfreq: -22.8525 -10.2358 -0.0003 0.0005 0.0006 18.3908 41.7787 83.6184 109.8002
frequency: 40.5823 82.8583 109.7729 138.9677 202.7525 235.4113 267.7219 322.0587 352.0124 401.6667 441.9141 555.1844 574.8398 670.0176 719.9972 758.7696 769.6570 782.8398 800.1625 845.0601 871.7498 883.8807 924.5849 929.3784 941.4749 953.8721 962.2536 990.7694 1014.8244 1048.6980 1057.6611 1102.9144 1119.9800 1131.0158 1147.9410 1157.3591 1198.2028 1204.2485 1240.6991 1246.7387 1268.8580 1272.3525 1285.4374 1286.0925 1294.5565 1309.6610 1311.9281 1338.7374 1434.7259 1458.9239 1466.1258 1470.8314 1489.2606 1610.7507 1680.6894 2988.0341 2990.9197 3005.5778 3008.3071 3012.3021 3043.7702 3056.3494 3066.4258 3070.2351 3076.4826 3090.1412 3387.7159 3501.0945 3548.6259
redmass: 5.0568 3.2137 3.7025 1.1860 2.4475 3.3442 3.6782 2.8955 3.4173 2.4351 1.7979 1.2886 3.0132 3.3308 4.6071 4.2094 3.1887 1.6758 1.5826 2.6450 2.7687 2.6406 2.2515 2.6225 2.4051 2.1068 1.6899 1.9846 2.0720 1.6086 1.6432 1.7978 1.2335 1.1153 1.9820 1.3864 1.4133 1.4984 1.9674 1.4281 1.3595 1.5692 1.1761 1.5414 1.4603 1.5343 1.5461 1.5834 1.6867 1.0886 1.0966 1.0845 1.1036 6.6766 1.0627 1.0831 1.0584 1.0619 1.0613 1.0611 1.1040 1.0887 1.0998 1.0976 1.1041 1.1057 1.0428 1.0984 1.0793
irintensity: 1.6765 0.7559 4.7433 16.5357 2.4744 10.6165 18.1648 0.3825 17.8605 0.9831 1.2363 140.2376 14.7405 2.2771 1.9678 6.2182 2.6443 121.4638 7.6515 2.3442 4.8271 7.3656 4.9616 4.2096 11.9019 2.0392 1.8995 5.9261 1.9839 0.0157 3.9080 11.2619 4.5403 1.0706 11.4628 1.9610 11.4136 2.2273 37.9038 3.7988 0.6007 4.6493 0.7016 0.8925 4.5117 11.7034 6.2894 15.6318 174.5350 12.7106 17.2907 8.1725 1.9189 130.0800 28.1718 26.5727 32.2907 71.4864 53.8903 14.4872 6.1877 74.2056 18.6648 30.9108 54.4919 22.3996 0.0459 1.2969 28.5359
temp: 298.150 k
press: 1.00000 atm
elementType: 8 7 7 6 6 6 6 6 6 6 6 1 1 1 1 1 1 1 1 1 1 1 1 1 1
symmnumber: 1
zpe: 568378.1 jmol-1
zpe.correction: 0.216484 hartree
zpe.thermalcorrener: 0.226950 hartree
zpe.thermalcorrenthalpy: 0.227894 hartree
zpe.thermalcorrgfe: 0.180034 hartree
zpe.sumelectzpe: -497.090575 hartree
zpe.sumelectthermal: -497.080109 hartree
zpe.sumelectthermalent: -497.079165 hartree
zpe.sumelectthermalfe: -497.127025 hartree
dipole: -0.8942 2.0765 -0.8079
dipole: 2.4009
quadrupole: -65.9168 -70.0757 -64.4646
quadrupole: 0.5182 -0.7793 0.8080
quadrupole: 0.9022 -3.2566 2.3544 0.5182 -0.7793 0.8080
hfenergy: -497.3070589 hartree
pointgroup: C01 [X(C8H14N2O1)]
dipole: -0.390838 -0.0275846 0.859482 debye
dipolederiv: -0.6742999 -0.0003991 0.1853743 0.0569781 -0.3412778 -0.0252031 -0.1034621 0.055662 -0.9234317 -0.4455398 -0.0549509 -0.3455058 -0.0255613 -0.4284287 0.0443191 -0.5485661 0.0505132 -0.430394 -0.2983187 0.0452782 -0.1521325 0.0569406 -0.0406299 0.0307854 -0.2640325 0.0472345 -0.3618742 0.1185428 0.0123819 -0.0242888 0.1753379 0.1481941 -0.0421033 0.0491231 -0.0298651 0.0446274 0.1181224 0.0160772 0.0203344 0.0333718 0.0431172 -0.0318305 0.0115258 -0.0166357 0.1482327 0.0118503 0.0556284 0.0065774 0.0362255 -0.0027126 -0.0093062 0.0065364 -0.0062719 -0.0595957 -0.3690939 -0.0313844 0.0535493 -0.0981712 0.0108348 0.0740338 0.0400307 0.0908092 0.033663 -0.0115817 -0.0302683 -0.016396 -0.0776597 0.0865142 0.0345125 0.0533358 0.0043279 0.056091 -0.0177719 0.058412 -0.0014614 -0.0205596 0.0995164 0.0297024 0.0014371 0.0204832 0.0696629 0.0776686 0.0053775 0.0443996 0.0210643 0.0915264 0.0575361 0.0322835 0.0656456 -0.009468 1.1991354 -0.0159737 0.2096792 -0.1442788 0.1249057 -0.0260746 0.3850589 -0.0911459 1.1687106 -0.0419385 0.106594 -0.0509911 0.0986102 -0.0741858 0.0665946 -0.0489956 0.0683737 0.02396 -0.0379938 0.0342654 -0.0998265 0.0283311 0.0438259 0.069032 -0.1138308 0.0719559 -0.1139151 -0.0457138 -0.1474826 -0.0530728 -0.1176761 -0.1014926 -0.0418433 -0.0255118 -0.0084298 0.0759632 0.0112045 0.0452758 0.1171903 0.0331288 0.0817872 0.0084069 0.098547 -0.0209213 -0.0232499 0.0071811 -0.0054413 -0.0300688 -0.004911 0.0204699 -0.0710625 -0.0453104 -0.0873835 -0.1495795 0.0160445 0.0785426 -0.0033328 0.0607404 -0.1408722 -0.0552963 0.006624 -0.1162309 0.0359926 0.0529783 -0.0618636 0.0861902 -0.038005 0.0623923 0.0114124 0.0456813 0.0721671 -0.0322386 0.0539437 -0.008652 -0.0658252 0.0009338 0.0199418 -0.1215683 -0.0315106 -0.0592889 -0.1533058 -0.0362217 -0.09752 0.0407835 -0.0975839 -0.121912 0.0962646 0.0253263 0.0417441 0.0415544 -0.1676589 -0.0680365 -0.0347354 -0.130499 0.0111526 -0.0117327 -0.0595692 -0.0039885 0.051973 0.0403302 0.0450289 0.0121462 0.1156486 -0.1344302 -0.0802352 0.0420237 -0.0849936 0.0124769 0.1047903 0.0487963 0.0708693 0.0684717 0.3162797 0.0017018 0.1004851 -0.0071943 0.141306 0.1817315 0.0361771 0.0352579 0.0222737 0.0895612 0.0806918 0.2094865 0.1121941 0.1895935 0.152609 -0.0658631 -0.0047144 -0.0531509 0.1359222 -0.0887373 0.133284 -0.1687611 0.1632454 unknown
polarizability: 116.7003073|-0.4772914|81.6598246|1.3626069|-1.9207572|91.2037612 unknown
InChI: InChI=1S/C8H14N2O/c9-10-8(11)7-4-5-1-2-6(7)3-5/h5-7,10H,1-4,9H2
charge 0 multiplicity 1
25 atoms
O  1.86361 0.421932 -1.36798
N  2.473859 0.31077 0.865692
N  3.847531 0.047524 0.609501
C  -0.683359 -0.703274 0.409919
C  -1.966856 0.563298 -0.985959
C  -1.244034 -0.813705 -1.03648
C  0.093209 0.668668 0.352803
C  -0.781458 1.512783 -0.644401
C  -1.982779 -0.467727 1.239033
C  -2.868839 0.409545 0.275793
C  1.528496 0.475209 -0.144436
H  -0.068309 -1.546016 0.7675
H  -2.515258 0.85703 -1.895958
H  -1.936305 -1.666043 -1.161087
H  -0.454399 -0.858018 -1.80543
H  0.11668 1.120608 1.364124
H  -1.118219 2.466668 -0.201066
H  -0.189556 1.731543 -1.550657
H  -1.776676 0.03332 2.202979
H  -2.473958 -1.431943 1.464857
H  -3.814228 -0.105628 0.025336
H  -3.130444 1.389647 0.714926
H  2.211159 0.349837 1.851507
H  4.275219 0.844926 0.116078
H  3.942812 -0.806352 0.040406
