program: Gaussian 09
title: 000296938
version: EM64L-G09RevD.01
frameworkgroup: C1[X(C8H10O4)]
method: RPBEPBE
basis: SDD
operation: Freq
keyword: #pfreq=noraman
keyword: PBEPBE/SDD
title: #p freq=noraman PBEPBE/SDD
converged: YES YES NO NO
title: Mulliken charges:
elementType: O O O O C C C C C C C C H H H H H H H H H H
charge: -0.415025 -0.415011 -0.230235 -0.230245 -0.327308 -0.327314 0.196226 0.196245 -0.792025 -0.792041 0.168754 0.168767 0.310949 0.310951 0.242723 0.242194 0.227013 0.242204 0.227023 0.242692 0.376732 0.376728
chargesum: 0.00000
title: Mulliken charges with hydrogens summed into heavy atoms:
elementType: O O O O C C C C C C C C
charge: -0.038292 -0.038283 -0.230235 -0.230245 -0.016359 -0.016363 0.196226 0.196245 -0.080094 -0.080121 0.168754 0.168767
polarizability: 1.17526516e+02 2.26018567e-03 9.05781970e+01 1.16718081e+01 3.82952321e-03 8.27131554e+01
1716.lowfreq: -9.1778 -9.0685 -5.4688 0.0001 0.0005 0.0011 27.5869 29.7535 64.4071
frequency: 27.4035 29.7147 64.4070 104.9299 109.9838 116.8752 127.5972 133.3898 214.9381 279.5296 296.4712 329.4870 349.1250 476.2746 488.3742 556.6947 566.4316 601.3384 616.5485 633.2933 662.2700 700.9883 770.3089 829.3091 921.5250 934.7125 953.9261 998.6586 1024.7298 1037.9879 1061.2254 1061.7514 1107.9986 1147.3272 1153.1097 1204.1012 1227.9651 1246.8594 1266.6687 1314.2798 1358.3391 1394.2937 1398.7578 1451.6297 1452.4143 1464.4922 1465.4943 1651.3164 1659.5348 1721.6785 2971.6965 2972.1579 3042.9463 3045.4563 3047.8395 3048.3450 3080.8802 3082.5458 3506.7672 3506.9051
redmass: 8.6518 10.5321 3.8997 1.3579 3.7470 2.1516 1.1047 4.5151 2.6727 5.4899 3.4373 7.8037 3.9177 3.3971 3.2783 2.1995 4.4757 1.6777 2.5289 2.2776 2.3047 3.4834 3.9909 5.1850 2.4875 2.5786 2.0469 3.4602 1.5481 1.6765 2.0950 1.7952 2.2135 1.4555 1.7490 2.0787 1.3145 1.7781 3.3817 2.5851 2.4614 1.3390 1.2433 1.0458 1.0455 1.0451 1.0673 8.9359 8.4907 8.6597 1.0369 1.0367 1.0863 1.0824 1.0967 1.0966 1.0988 1.0988 1.0639 1.0639
irintensity: 0.2918 1.3438 0.2555 0.4660 0.0842 4.7369 0.0118 0.7121 0.4440 0.1166 4.0296 0.0107 3.1605 55.3546 5.0680 97.2569 13.6778 88.1460 29.0912 22.3406 124.4655 9.9144 6.3965 18.8878 0.0001 39.8009 0.9774 5.0354 0.1784 3.3241 449.2267 10.9756 16.4503 80.5546 26.6494 7.9353 6.2353 0.1190 11.6179 129.8793 8.1016 16.9183 21.3230 0.4792 24.3944 16.4836 10.9162 329.8897 88.8234 16.1772 26.5406 18.2651 2.3281 5.7985 0.1070 31.5452 10.7109 28.3272 40.5425 2.4371
temp: 298.150 k
press: 1.00000 atm
elementType: 8 8 8 8 6 6 6 6 6 6 6 6 1 1 1 1 1 1 1 1 1 1
symmnumber: 1
zpe: 437067.6 jmol-1
zpe.correction: 0.166470 hartree
zpe.thermalcorrener: 0.179705 hartree
zpe.thermalcorrenthalpy: 0.180649 hartree
zpe.thermalcorrgfe: 0.124806 hartree
zpe.sumelectzpe: -610.816480 hartree
zpe.sumelectthermal: -610.803245 hartree
zpe.sumelectthermalent: -610.802300 hartree
zpe.sumelectthermalfe: -610.858143 hartree
dipole: 0.0003 2.2157 -0.0003
dipole: 2.2157
quadrupole: -55.8418 -67.6660 -79.1570
quadrupole: 0.0002 2.5272 -0.0031
quadrupole: 11.7131 -0.1111 -11.6020 0.0002 2.5272 -0.0031
hfenergy: -610.9829498 hartree
pointgroup: C01 [X(C8H10O4)]
dipole: -0.0000276 0.871709 -0.0001096 debye
dipolederiv: -0.9171233 -0.0329111 -0.533259 0.001215 -0.3864553 -0.0634867 -0.4465952 -0.0696855 -0.6595635 -0.9169289 0.0331448 -0.5333317 -0.001004 -0.3864547 0.0636981 -0.4466748 0.069866 -0.6597807 -0.6552558 -0.2197933 0.0936272 -0.0785088 -0.4485338 0.2362921 -0.0314833 0.2914079 -0.8132924 -0.6552412 0.2198555 0.0936248 0.0786344 -0.4485003 -0.2362448 -0.0315134 -0.2911959 -0.8133535 -0.1974117 -0.0787631 -0.0595584 -0.2242811 -0.2273579 0.1186966 0.0293874 0.0986686 -0.0364208 -0.1974228 0.0788384 -0.0595965 0.2243413 -0.2275184 -0.1186171 0.0292281 -0.0985494 -0.0363547 0.014451 -0.0841699 0.1703501 -0.0398854 0.3416281 -0.2138103 0.245146 -0.0474553 -0.0070616 0.0146192 0.0842093 0.1703662 0.039932 0.3417161 0.2136647 0.2449973 0.0472879 -0.0073188 -0.0354042 0.0735861 -0.091345 0.0342198 -0.112319 0.0613994 -0.1455595 0.0679462 0.0445958 -0.0355283 -0.0736234 -0.091412 -0.0342552 -0.112347 -0.0612761 -0.1453387 -0.0678487 0.044766 1.4252853 0.4709809 0.323666 0.2855345 0.4240928 -0.3206754 0.2270774 -0.4070921 1.1891581 1.4250682 -0.4713908 0.3237946 -0.2859706 0.4241394 0.3203716 0.2272782 0.4066962 1.1893752 0.0954683 -0.0300972 0.0179152 -0.0493855 0.0510443 -0.0593004 -0.0140963 -0.066871 0.0076672 0.0954515 0.0300921 0.0178998 0.0493565 0.0510824 0.0592853 -0.0140761 0.0668325 0.0076205 -0.1192444 0.0116809 0.023897 -0.0109458 0.0933786 0.0445712 0.0667684 0.0159005 0.083198 0.0842541 0.0242856 0.0151609 0.062034 0.0773187 -0.0221084 -0.0359107 0.021742 -0.1248875 0.0810279 -0.0728169 -0.0330733 -0.0230848 -0.1337614 -0.0149142 -0.023897 -0.0624507 0.0809408 0.0843241 -0.024281 0.0149686 -0.0619817 0.0773082 0.0222662 -0.0360934 -0.021637 -0.1248536 0.0809526 0.0729565 -0.0330088 0.0232147 -0.1337397 0.0148104 -0.0239747 0.0623149 0.0810341 -0.1192448 -0.0118212 0.0240518 0.0107877 0.0933443 -0.0446441 0.0669321 -0.0158896 0.0830455 0.2239542 -0.0688246 0.0726299 -0.077954 0.320967 0.079295 0.1292046 0.1070536 0.2357365 0.223949 0.0688623 0.0726328 0.077987 0.3209675 -0.0792729 0.1291936 -0.1070413 0.2357493 unknown
polarizability: 113.0014548|-0.000526|90.5781948|16.5314089|-0.0068885|87.2382185 unknown
InChI: InChI=1S/C8H10O4/c1-3-4(2)6(8(11)12)5(3)7(9)10/h5-6,9,11H,1-2H3
charge 0 multiplicity 1
22 atoms
O  -2.910228 -0.939376 -0.892037
O  2.909961 -0.93998 0.892755
O  -2.054014 -1.491194 1.195069
O  2.0541 -1.491145 -1.194668
C  -0.612726 -0.380297 -0.490864
C  0.612712 -0.380178 0.491127
C  -0.543715 1.173461 -0.416806
C  0.543763 1.173564 0.416571
C  -1.408957 2.209431 -1.06118
C  1.409078 2.209708 1.060567
C  -1.876798 -1.002298 0.057079
C  1.87676 -1.002384 -0.056636
H  -0.389522 -0.795881 -1.488881
H  0.389501 -0.795441 1.489271
H  -2.470538 2.076432 -0.778501
H  -1.365211 2.13273 -2.164684
H  -1.098816 3.229405 -0.773477
H  1.366427 2.132507 2.164073
H  1.098129 3.229634 0.773567
H  2.470472 2.077435 0.776817
H  -3.735488 -1.339701 -0.503443
H  3.735213 -1.340435 0.504278
