program: Gaussian 09
title: 000296934
version: EM64L-G09RevD.01
frameworkgroup: C1[X(C9H16O)]
method: RPBEPBE
basis: SDD
operation: Freq
keyword: #pfreq=noraman
keyword: PBEPBE/SDD
title: #p freq=noraman PBEPBE/SDD
converged: NO YES NO NO
title: Mulliken charges:
elementType: O C C C C C C C C C H H H H H H H H H H H H H H H H
charge: -0.454033 -0.126588 -0.069649 0.008417 -0.501312 -0.479192 -0.479282 -0.445863 -0.447262 -0.438760 0.192084 0.195077 0.232927 0.220543 0.211806 0.208946 0.210614 0.210254 0.201366 0.212008 0.199140 0.207503 0.204522 0.191112 0.195643 0.339981
chargesum: 0.00000
title: Mulliken charges with hydrogens summed into heavy atoms:
elementType: O C C C C C C C C C
charge: -0.114052 0.065496 0.125428 0.241344 -0.068963 -0.059632 -0.067662 -0.034715 -0.035237 -0.052006
polarizability: 1.01946035e+02 -5.85618383e-01 8.86923862e+01 -1.68577647e+00 3.05039712e-01 8.59829524e+01
1716.lowfreq: -41.0026 -12.3126 -9.5975 -0.0008 -0.0004 0.0003 43.9678 96.5622 173.0998
frequency: 40.5853 96.5286 173.0931 211.0277 264.8663 274.1735 315.6932 344.6729 397.4469 441.5772 497.8919 532.5530 625.6048 756.6994 783.6406 803.5244 811.5542 843.2749 859.5172 882.1841 928.1738 948.8204 961.2877 967.9659 993.9000 1041.9730 1062.0984 1066.6414 1076.0465 1100.9270 1101.9492 1125.5048 1146.9261 1171.1332 1192.1024 1219.1588 1226.8389 1232.1550 1260.5551 1269.5691 1289.4175 1306.1055 1309.9191 1319.5177 1322.5165 1328.1237 1332.3313 1353.0130 1368.6531 1404.4668 1459.8084 1462.8090 1469.1929 1473.8057 1475.2514 1490.4501 2921.4309 2965.8016 2967.9726 2971.8666 2977.6331 2982.4604 2987.3593 2989.9089 2998.2874 3011.6203 3020.3601 3021.7655 3042.7931 3051.4743 3053.0849 3565.5821
redmass: 2.2188 3.6432 2.9836 1.9014 1.4886 1.2588 3.1662 1.9759 2.8105 2.7120 3.5395 3.1661 6.0675 2.0260 1.7768 1.7821 2.4447 1.9361 2.2814 1.7423 2.1971 2.1855 3.7579 2.5226 2.0960 2.0836 2.0625 1.8422 2.0417 1.4878 1.6837 1.1254 1.0294 1.1422 1.2922 1.1984 1.1546 1.1664 1.4540 1.6886 1.6124 1.4691 1.4446 1.5146 1.4349 1.5043 1.4341 1.4191 1.4633 1.4441 1.0820 1.0763 1.0814 1.0825 1.0878 1.0915 1.0540 1.0951 1.0631 1.0590 1.0707 1.0643 1.0672 1.0844 1.0810 1.0888 1.0991 1.1006 1.1032 1.1034 1.1001 1.0665
irintensity: 1.0519 5.4491 3.6846 12.4932 34.7676 104.0649 2.0928 0.4907 0.6189 6.6500 5.4580 0.0781 1.6523 3.5329 1.2211 6.8143 4.3125 5.7602 0.9200 5.3985 1.4242 15.9573 35.2265 11.0693 3.5778 10.2955 1.9622 11.1167 0.9344 5.2264 4.3935 4.4008 1.4145 3.5675 3.5401 8.7801 0.1123 1.7375 13.5272 12.7914 2.0251 0.3693 0.3914 0.9287 0.4136 1.9544 0.9186 1.6856 0.3307 1.0856 4.0175 0.2340 7.1251 8.4028 19.4149 3.5660 60.9266 22.7550 11.6865 5.8025 17.5986 48.5158 54.8678 106.0063 186.3280 31.9307 7.1126 7.2036 23.1017 117.9867 72.6656 1.7303
temp: 298.150 k
press: 1.00000 atm
elementType: 8 6 6 6 6 6 6 6 6 6 1 1 1 1 1 1 1 1 1 1 1 1 1 1 1 1
symmnumber: 1
zpe: 614549.3 jmol-1
zpe.correction: 0.234069 hartree
zpe.thermalcorrener: 0.243668 hartree
zpe.thermalcorrenthalpy: 0.244612 hartree
zpe.thermalcorrgfe: 0.199216 hartree
zpe.sumelectzpe: -426.954584 hartree
zpe.sumelectthermal: -426.944985 hartree
zpe.sumelectthermalent: -426.944041 hartree
zpe.sumelectthermalfe: -426.989437 hartree
dipole: -0.2042 1.4598 0.7838
dipole: 1.6695
quadrupole: -57.9731 -63.3250 -62.4871
quadrupole: -4.4634 -3.4753 -0.3726
quadrupole: 3.2886 -2.0633 -1.2253 -4.4634 -3.4753 -0.3726
hfenergy: -427.1886531 hartree
pointgroup: C01 [X(C9H16O1)]
dipole: 0.089776 -0.5211104 0.3895996 debye
dipolederiv: -0.6765427 -0.2406699 0.1809089 -0.3130349 -0.482454 -0.1132163 0.2375822 -0.1060607 -0.431795 0.0755006 -0.004111 -0.0216391 0.0295015 0.1349596 0.0222645 -0.0261889 0.0167236 0.0962976 0.0981509 -0.023442 0.0074815 -0.0068128 0.1297181 0.014583 -0.0170161 0.0104941 0.1009752 -0.0418235 -0.0562788 -0.020433 0.0047108 0.0187969 0.0075273 -0.0863032 0.0010808 0.0917871 0.0104326 0.0450111 0.0071486 0.0140938 0.0714759 -0.0155697 0.0244652 -0.02481 0.0905733 0.0491014 0.05771 -0.0400102 0.0273887 0.0675414 0.0137224 -0.0498468 0.0289892 0.0860059 0.0951147 0.0247067 0.0428667 0.0102263 0.0817829 -0.0123715 0.0568856 -0.0330756 -0.0070164 0.1018723 -0.0209503 -0.0526155 -0.0215677 0.058093 -0.0494647 -0.0294484 -0.0635951 0.0384118 0.1181518 0.0057206 0.0037022 0.001586 0.0250078 0.0580857 0.0038501 0.0768271 0.0518692 0.6003187 0.1786045 -0.1140994 0.1682097 0.3987504 0.0250372 -0.1036573 0.0431433 0.3481068 0.0003878 0.1105297 0.0284695 0.0876608 -0.1971757 -0.0566251 0.0300794 -0.0527713 0.0147617 -0.0091262 0.089241 0.0189097 0.0943373 -0.2008791 -0.0564713 0.0247683 -0.0588916 0.021171 0.0427599 0.0053985 0.0164622 0.0261371 0.0293366 0.0217714 0.0519067 -0.0046286 -0.1743979 0.0362181 -0.0206359 0.0436481 -0.0388257 -0.0865395 0.0846588 0.0576662 0.1383746 -0.0321349 -0.0106905 -0.0302961 -0.0960373 -0.0132525 0.0388709 -0.0263936 -0.1203013 -0.0827632 -0.1126502 -0.1230252 -0.127037 0.0000538 -0.1078173 -0.0740237 -0.0034019 0.0427831 0.0458068 0.0705039 0.0564399 0.0396165 0.0804355 0.012567 0.029276 -0.0254204 0.0278698 -0.0624522 -0.1940418 -0.0779126 0.0908445 -0.1442272 0.0449608 0.0305259 0.0005184 -0.1318064 0.0313165 -0.0564404 -0.0650589 -0.1416052 0.0649823 -0.0980724 -0.1149356 0.0526957 0.0338057 0.0119012 0.0578887 0.0716914 -0.0440196 0.064059 0.0056065 -0.053976 0.1046629 0.0155548 0.1175966 -0.1197537 -0.2291125 0.0491463 -0.0135585 0.0111575 0.0328639 -0.0041332 0.0432208 -0.0230499 0.0672927 -0.2123595 0.0026911 0.0909606 -0.0292217 0.029984 0.0081506 0.0278721 0.0053857 0.0640229 0.0430163 -0.0351389 -0.1118309 0.0034743 -0.0026986 -0.0980091 -0.0501026 -0.0815744 -0.1529775 -0.0415536 0.0361133 0.0339655 0.0379927 -0.2344104 -0.05078 0.0514399 -0.0842889 0.0283505 0.0126467 -0.0376896 0.0439442 -0.0510015 0.0134775 0.0000289 0.0439676 0.0595967 -0.2233651 0.0754019 0.0465405 -0.1135471 0.0999955 0.2566317 0.0981501 -0.1590464 0.0907252 0.2765543 unknown
polarizability: 102.0395954|-0.4346931|88.5422966|1.2243181|-0.697013|86.0394812 unknown
InChI: InChI=1S/C9H16O/c10-6-9-5-7-1-3-8(9)4-2-7/h7-10H,1-6H2
charge 0 multiplicity 1
26 atoms
O  3.231139 0.44254 -0.299232
C  -0.242442 -1.176084 -0.265954
C  -1.12152 1.2121 0.311683
C  0.890389 -0.130788 -0.496851
C  0.405457 1.258748 0.037896
C  -1.430896 -0.813428 -1.198697
C  -0.737211 -1.138317 1.207199
C  -1.856291 0.674399 -0.94621
C  -1.392269 0.253995 1.502869
C  2.228616 -0.560285 0.112835
H  0.126463 -2.192572 -0.512697
H  -1.489608 2.227708 0.556244
H  1.059238 -0.059974 -1.591032
H  0.649106 2.055464 -0.687508
H  0.942436 1.513624 0.973001
H  -2.275293 -1.501498 -0.998579
H  -1.13952 -0.962777 -2.256001
H  0.105907 -1.32943 1.898324
H  -1.465985 -1.955049 1.370495
H  -1.602792 1.307522 -1.818476
H  -2.951663 0.748461 -0.805031
H  -2.484586 0.149628 1.652306
H  -0.982125 0.688954 2.434477
H  2.512368 -1.568612 -0.262133
H  2.157175 -0.601866 1.222086
H  4.106407 0.218438 0.105584
