program: Gaussian 09
title: 000296950
version: EM64L-G09RevD.01
frameworkgroup: C1[X(C16H20O2)]
method: RPBEPBE
basis: SDD
operation: Freq
keyword: #pfreq=noraman
keyword: PBEPBE/SDD
title: #p freq=noraman PBEPBE/SDD
converged: YES YES NO NO
title: Mulliken charges:
elementType: O O C C C C C C C C C C C C C C C C H H H H H H H H H H H H H H H H H H H H
charge: -0.212540 -0.266748 -0.175554 -0.196903 -0.244474 -0.199677 -0.543105 -0.454985 -0.483965 0.417567 0.174597 -0.395371 -0.398566 -0.786831 -0.379098 -0.379625 0.318591 -0.537657 0.236739 0.241816 0.287981 0.231419 0.229423 0.261759 0.219261 0.234105 0.210834 0.228806 0.242383 0.221732 0.236379 0.239389 0.255503 0.247796 0.236502 0.218181 0.244117 0.220221
chargesum: 0.00000
title: Mulliken charges with hydrogens summed into heavy atoms:
elementType: O O C C C C C C C C C C C C C C C C
charge: -0.212540 -0.266748 0.061184 0.044913 0.043507 0.031742 -0.051923 -0.001620 -0.044326 0.417567 0.174597 -0.152987 -0.176834 -0.055560 -0.131303 -0.143122 0.318591 0.144863
polarizability: 2.21254455e+02 -2.44989309e+00 1.69679253e+02 -5.47887368e+00 1.02125707e+01 1.27105243e+02
1716.lowfreq: -16.0394 -7.1745 0.0007 0.0007 0.0008 4.2901 31.9751 51.1322 54.1745
frequency: 31.5453 51.0962 54.1255 68.5975 100.4766 113.5079 116.0046 155.6321 165.2074 211.0333 229.0287 253.8901 270.5048 313.9477 328.6592 340.1511 414.0495 417.0812 452.9305 460.2917 505.5290 531.5567 563.8290 574.6594 597.1344 633.2375 711.4503 731.7507 756.0284 762.1017 801.9353 805.7124 819.7277 833.4974 856.6336 874.7401 890.6533 915.6360 934.5918 937.6451 940.3052 961.5996 964.6407 970.6313 977.3961 989.8734 1005.2962 1005.4282 1037.9949 1045.9094 1070.7123 1112.0479 1112.2945 1116.6801 1133.6442 1147.3203 1157.0757 1170.0472 1180.2393 1182.0385 1197.3427 1223.5172 1229.5058 1232.2454 1241.8334 1269.3761 1277.4268 1290.1759 1294.0736 1299.6910 1308.9290 1324.0884 1337.5999 1364.9076 1366.4811 1415.2722 1436.0294 1442.4525 1454.6823 1464.9195 1465.8216 1467.3112 1473.4462 1486.5412 1502.6951 1578.8553 1620.8984 1624.3148 2948.5086 2955.2972 2977.1703 2995.0621 3002.5837 3011.0999 3011.8811 3041.1753 3046.7301 3052.6682 3060.7164 3061.9378 3077.5638 3085.2359 3119.5980 3121.5875 3123.3801 3137.6027 3156.6221 3165.0738
redmass: 3.7741 4.2159 3.5339 4.6902 3.4087 3.1121 1.0684 4.2306 3.8589 2.7171 1.3729 2.7190 3.0269 3.5184 4.1487 3.2126 2.9415 2.8849 2.2188 3.7663 3.1209 3.3239 3.2381 4.1117 3.2023 6.9542 3.5233 3.3638 5.0460 4.8299 1.6413 1.6665 1.6792 1.9627 2.7516 2.2957 2.5599 3.2933 2.0094 1.7574 2.1656 1.7155 1.5569 1.5809 1.9658 8.5198 1.8481 2.4892 2.2993 1.6468 1.7512 1.2683 1.2608 1.2588 1.4062 1.3867 1.3370 1.9049 1.4234 1.3959 1.2683 1.7984 1.8911 2.7171 1.3195 1.3350 1.6045 1.4732 1.5747 1.5410 1.3535 1.4696 1.7259 5.3114 1.2571 3.7081 1.1679 1.0720 1.0544 1.0919 1.0508 1.0796 1.0723 1.0969 2.4470 7.1911 7.5987 6.3796 1.0815 1.0332 1.0381 1.0597 1.0844 1.0600 1.0630 1.1037 1.0887 1.1017 1.0928 1.0928 1.1037 1.1062 1.1004 1.0936 1.0932 1.0876 1.0941 1.0961
irintensity: 1.2138 4.1394 0.3452 3.5873 2.0092 3.0596 0.1780 0.1645 4.5402 5.3850 0.1465 1.2116 0.2637 0.9816 4.0507 1.7727 0.0333 0.8144 0.6716 0.3301 6.6599 18.3913 14.4153 4.0228 4.8693 0.8536 2.1302 2.3287 10.3674 0.4396 30.2167 7.9986 2.0127 28.1738 5.4097 5.5015 7.8212 0.8512 1.1728 0.9083 1.2340 12.0983 6.8646 0.0634 6.2019 40.3657 1.4463 16.5453 2.1804 7.5170 2.9330 7.6960 1.1753 2.0059 1.0069 19.6122 1.1243 62.6844 41.4781 38.9475 7.8987 22.3380 25.6532 130.9405 25.5465 0.8019 0.3682 12.8722 15.9019 6.8327 2.8255 2.5779 32.1792 13.6911 65.6650 2.9169 10.5317 20.0723 17.0706 17.1837 14.4500 2.2407 58.7907 8.2367 139.9239 5.9648 89.1293 39.7597 8.0999 69.8473 2.4953 28.4088 20.3920 29.8011 54.3589 51.3484 75.2897 11.6960 13.7368 20.7298 47.6856 37.4273 18.5323 47.7436 1.2272 13.8773 17.8287 5.9540
temp: 298.150 k
press: 1.00000 atm
elementType: 8 8 6 6 6 6 6 6 6 6 6 6 6 6 6 6 6 6 1 1 1 1 1 1 1 1 1 1 1 1 1 1 1 1 1 1 1 1
symmnumber: 1
zpe: 841626.2 jmol-1
zpe.correction: 0.320558 hartree
zpe.thermalcorrener: 0.337330 hartree
zpe.thermalcorrenthalpy: 0.338274 hartree
zpe.thermalcorrgfe: 0.275362 hartree
zpe.sumelectzpe: -770.785575 hartree
zpe.sumelectthermal: -770.768803 hartree
zpe.sumelectthermalent: -770.767859 hartree
zpe.sumelectthermalfe: -770.830771 hartree
dipole: -0.2986 0.6551 3.2950
dipole: 3.3727
quadrupole: -99.9917 -101.6437 -112.8976
quadrupole: -11.3736 3.8205 9.7068
quadrupole: 4.8527 3.2006 -8.0533 -11.3736 3.8205 9.7068
hfenergy: -771.1061337 hartree
pointgroup: C01 [X(C16H20O2)]
dipole: -0.1023554 0.2260286 1.3035241 debye
polarizability: 221.0931815|-2.6079021|169.1793316|-6.406169|11.3396349|127.7664376 unknown
InChI: InChI=1S/C16H20O2/c1-10(17)15-12-3-4-13(9-12)16(15)11-5-7-14(18-2)8-6-11/h5-8,12-13,15-16H,3-4,9H2,1-2H3
charge 0 multiplicity 1
38 atoms
O  2.556016 2.053353 -1.447465
O  -4.793733 -0.132716 0.148987
C  1.632506 -1.644795 -0.690741
C  3.014953 -0.44073 0.663861
C  0.937947 -0.242618 -0.657091
C  1.833781 0.566418 0.357753
C  3.127775 -1.218573 -0.676948
C  1.485689 -2.354441 0.690738
C  2.456366 -1.535979 1.619635
C  -0.562016 -0.209295 -0.379346
C  2.392851 1.873067 -0.208655
C  -1.403324 -1.309986 -0.705605
C  -1.18824 0.952503 0.135064
C  2.778681 2.945347 0.804892
C  -2.796382 -1.255528 -0.519603
C  -2.586818 1.030974 0.329266
C  -3.396274 -0.082957 0.001369
C  -5.45782 1.061717 0.672468
H  1.326874 -2.266416 -1.548653
H  3.935024 0.046672 1.029364
H  1.109334 0.224983 -1.650759
H  1.301991 0.786904 1.302849
H  3.824683 -2.073415 -0.612655
H  3.405747 -0.579704 -1.53276
H  1.798619 -3.412017 0.619123
H  0.444195 -2.338925 1.054183
H  1.941147 -1.102229 2.495636
H  3.280158 -2.169972 1.996563
H  -0.964393 -2.225525 -1.116323
H  -0.580448 1.83188 0.380041
H  1.861106 3.393876 1.234614
H  3.347066 2.511933 1.648303
H  3.368297 3.739355 0.320881
H  -3.438844 -2.105236 -0.770932
H  -3.024259 1.952488 0.725565
H  -5.104502 1.306165 1.693738
H  -6.52746 0.806768 0.702637
H  -5.301893 1.935051 0.008909
