program: Gaussian 09
title: 000296949
version: EM64L-G09RevD.01
frameworkgroup: C1[X(C15H16O3)]
method: RPBEPBE
basis: SDD
operation: Freq
keyword: #pfreq=noraman
keyword: PBEPBE/SDD
title: #p freq=noraman PBEPBE/SDD
converged: YES YES NO NO
title: Mulliken charges:
elementType: O O O C C C C C C C C C C C C C C C H H H H H H H H H H H H H H H H
charge: -0.417201 -0.239198 -0.267003 -0.256759 -0.250235 -0.283532 -0.242986 -0.554883 -0.184623 -0.238439 0.459020 0.144783 -0.399977 -0.394903 -0.377909 -0.379757 0.321514 -0.537624 0.252054 0.256241 0.281879 0.295494 0.256029 0.252539 0.241618 0.242210 0.239401 0.237736 0.373699 0.248042 0.238472 0.220123 0.219901 0.244273
chargesum: 0.00000
title: Mulliken charges with hydrogens summed into heavy atoms:
elementType: O O O C C C C C C C C C C C C C C C
charge: -0.043502 -0.239198 -0.267003 -0.004706 0.006006 -0.001654 0.052508 -0.046315 0.056995 0.003771 0.459020 0.144783 -0.160576 -0.157167 -0.129867 -0.141285 0.321514 0.146673
polarizability: 2.10668480e+02 1.40668140e+00 1.63724823e+02 -5.15299366e+00 9.45687521e+00 1.17684724e+02
1716.lowfreq: -4.5500 -3.5068 0.0006 0.0006 0.0008 4.2842 23.0142 35.4122 50.6710
frequency: 22.9407 35.3857 50.6349 73.3259 106.1802 131.2556 154.5621 164.3771 222.2881 230.1660 267.9655 314.4043 323.7279 325.0755 401.7926 413.9742 456.8905 465.5615 498.2362 525.4172 559.3463 590.4541 604.6823 632.5317 650.1692 702.2090 718.6669 723.2197 758.1014 774.6153 795.7855 810.2347 822.0763 848.4113 868.0374 891.8357 913.0688 920.1525 931.3660 937.8653 950.2849 961.9245 970.3967 987.7351 992.8750 998.6197 1005.1899 1031.8926 1062.8486 1093.1004 1107.3312 1112.2583 1117.7276 1147.5095 1156.7385 1177.6802 1182.9564 1206.1925 1220.3262 1226.3295 1233.7682 1244.1674 1264.5942 1267.8778 1280.9897 1303.2340 1308.2077 1331.8014 1355.6183 1365.1940 1415.9346 1436.2079 1466.0570 1469.4487 1473.3449 1504.1947 1579.6963 1581.8742 1624.7957 1648.7244 2956.6866 2974.2039 3025.2259 3043.0956 3076.4264 3079.2203 3088.6320 3101.2543 3122.7555 3124.9069 3137.5671 3158.3493 3160.7384 3165.6168 3193.0911 3503.1942
redmass: 8.4786 3.8811 4.6219 5.0193 3.8215 3.9926 5.0068 4.1264 3.2996 1.2655 5.2147 4.2181 5.0963 4.4303 3.9821 2.9563 3.8481 2.4562 2.5763 2.6925 4.2462 2.3542 2.3420 6.8229 2.3835 3.2569 3.3709 1.8907 4.6984 4.9629 4.0626 1.7660 1.5023 2.9061 2.5230 4.0639 2.3227 1.4760 2.0115 2.4611 1.9405 1.4644 2.4930 4.3057 2.7603 1.8041 2.4956 2.0977 2.1826 1.2181 1.1430 1.2607 1.3616 1.4523 1.3399 1.3066 1.3153 1.4741 1.3964 1.5718 3.2048 1.4731 1.8016 1.3528 1.4355 1.6766 1.2885 1.7243 1.8514 5.5390 3.6634 1.1669 1.0507 1.1021 1.0703 2.4521 6.7909 6.0692 6.3283 7.9086 1.0331 1.0826 1.0592 1.1038 1.0858 1.0885 1.0922 1.1071 1.0969 1.0906 1.0876 1.0941 1.0875 1.0960 1.1095 1.0638
irintensity: 1.3879 0.9945 0.1705 2.6986 2.9421 1.0180 0.1776 2.7368 2.8847 0.4787 0.8656 1.5045 6.4276 5.3155 3.5381 0.0390 2.4065 5.1437 2.5033 15.5418 26.3237 57.2289 41.7444 1.4771 47.7904 56.6063 5.2357 34.8949 26.5190 4.5687 10.7768 28.0025 7.1531 31.7907 8.0713 8.3209 2.8138 5.6799 7.0385 8.7939 1.5115 1.5058 12.0565 45.8066 4.7408 3.5093 13.1408 154.4301 165.1327 4.3746 1.0991 0.2380 8.7982 2.0521 0.5288 1.8564 81.7912 20.7137 8.8768 22.1757 126.6387 1.3681 9.8842 1.7037 6.1169 20.7956 3.5147 12.5486 69.4326 9.1646 2.9571 10.1066 14.1863 19.8778 53.6184 137.7252 5.1207 2.1170 37.2397 193.8584 68.7802 4.7788 29.0970 50.5695 8.8565 48.1791 11.6650 21.1599 39.3550 1.6822 15.6821 15.5911 4.7524 6.3026 15.3194 24.1597
temp: 298.150 k
press: 1.00000 atm
elementType: 8 8 8 6 6 6 6 6 6 6 6 6 6 6 6 6 6 6 1 1 1 1 1 1 1 1 1 1 1 1 1 1 1 1
symmnumber: 1
zpe: 720233.3 jmol-1
zpe.correction: 0.274322 hartree
zpe.thermalcorrener: 0.290029 hartree
zpe.thermalcorrenthalpy: 0.290974 hartree
zpe.thermalcorrgfe: 0.229772 hartree
zpe.sumelectzpe: -805.514284 hartree
zpe.sumelectthermal: -805.498577 hartree
zpe.sumelectthermalent: -805.497633 hartree
zpe.sumelectthermalfe: -805.558835 hartree
dipole: -0.7786 1.1866 1.6027
dipole: 2.1408
quadrupole: -98.6016 -95.2800 -109.8925
quadrupole: -6.9873 1.2500 5.1074
quadrupole: 2.6564 5.9781 -8.6344 -6.9873 1.2500 5.1074
hfenergy: -805.7886067 hartree
pointgroup: C01 [X(C15H16O3)]
dipole: 0.2707817 -0.424966 0.6748775 debye
polarizability: 210.1380806|1.5071839|162.0692205|8.6961432|-12.7166129|119.8707263 unknown
InChI: InChI=1S/C15H16O3/c1-18-12-6-4-9(5-7-12)13-10-2-3-11(8-10)14(13)15(16)17/h2-7,10-11,13-14,16H,8H2,1H3
charge 0 multiplicity 1
34 atoms
O  -2.512689 -2.790768 0.843269
O  -2.928079 -2.021146 -1.304609
O  4.736024 0.07951 0.237096
C  -1.642112 1.655689 -0.792007
C  -3.037876 0.573771 0.639548
C  -0.972341 0.218695 -0.695244
C  -1.886852 -0.511253 0.365273
C  -3.145559 1.243802 -0.761953
C  -1.501072 2.328039 0.579365
C  -2.340432 1.678891 1.437746
C  0.52251 0.179867 -0.389096
C  -2.477777 -1.799706 -0.155746
C  1.377151 1.267891 -0.716799
C  1.123454 -0.977823 0.163112
C  2.765289 1.205654 -0.498459
C  2.516174 -1.062129 0.391364
C  3.342498 0.038259 0.058607
C  5.377443 -1.105654 0.808791
H  -1.308286 2.240488 -1.662215
H  -3.951669 0.148391 1.080535
H  -1.142933 -0.274081 -1.674438
H  -1.353034 -0.722778 1.304156
H  -3.823751 2.112913 -0.75844
H  -3.425081 0.539872 -1.564674
H  -0.780144 3.11127 0.826281
H  -2.433918 1.820141 2.517481
H  0.956307 2.17973 -1.153742
H  0.500649 -1.842676 0.42201
H  -2.942306 -3.608399 0.469471
H  3.420679 2.045327 -0.749892
H  2.935291 -1.976703 0.821671
H  5.231391 -1.99503 0.164686
H  4.996374 -1.319855 1.826669
H  6.447877 -0.857499 0.859186
