program: Gaussian 09
title: 000296966
version: EM64L-G09RevD.01
frameworkgroup: C1[X(C18H24O4)]
method: RPBEPBE
basis: SDD
operation: Freq
keyword: #pfreq=noraman
keyword: PBEPBE/SDD
title: #p freq=noraman PBEPBE/SDD
converged: YES YES NO NO
title: Mulliken charges:
elementType: O O O O C C C C C C C C C C C C C C C C C C H H H H H H H H H H H H H H H H H H H H H H H H
charge: -0.269764 -0.291506 -0.269786 -0.291489 -0.187282 -0.184791 -0.186919 -0.184551 -0.370761 -0.371456 -0.370886 -0.371596 0.285954 0.285996 -0.224959 -0.200729 -0.224985 -0.200697 -0.538354 -0.532831 -0.538357 -0.532827 0.294633 0.258062 0.294654 0.257978 0.257530 0.257044 0.257516 0.257028 0.237551 0.235046 0.237551 0.235044 0.226599 0.226150 0.218560 0.240637 0.206398 0.228126 0.226157 0.218567 0.226597 0.240638 0.206410 0.228101
chargesum: 0.00000
title: Mulliken charges with hydrogens summed into heavy atoms:
elementType: O O O O C C C C C C C C C C C C C C C C C C
charge: -0.269764 -0.291506 -0.269786 -0.291489 0.107351 0.073270 0.107735 0.073427 -0.113232 -0.114411 -0.113370 -0.114568 0.285954 0.285996 0.012592 0.034318 0.012566 0.034347 0.132954 0.142331 0.132964 0.142322
polarizability: 2.16121862e+02 1.03957635e+01 1.86140979e+02 2.73275712e-04 -5.62517907e-04 1.64194145e+02
1716.lowfreq: -9.3930 -1.9141 -0.0009 -0.0008 -0.0005 18.1650 71.2138 73.5389 92.4316
frequency: 71.2133 73.5321 92.4315 103.1484 105.3894 106.2699 110.5641 116.5783 130.0501 153.7889 172.6514 184.3750 188.2728 225.4654 228.1045 272.6697 280.7555 282.8127 294.4089 313.0761 345.6881 356.3486 370.9352 413.0096 426.9691 439.4906 457.7802 489.0706 503.4502 527.2304 551.3985 634.8023 637.5089 686.7452 688.1829 712.7936 748.4700 755.9675 788.0151 806.1710 821.5503 826.8346 840.7302 862.7375 910.5132 912.2163 916.0212 923.7993 924.7532 936.1610 941.9430 945.1683 959.2876 965.0464 965.1317 970.1042 975.8594 993.7984 1005.9274 1009.2995 1022.2105 1037.0293 1058.3020 1076.3997 1079.3716 1084.5957 1090.6910 1103.7052 1111.0681 1113.0664 1114.6690 1118.5978 1119.9344 1123.2948 1151.2972 1155.2921 1155.3829 1161.3057 1181.7357 1186.8953 1190.7609 1198.8289 1203.4609 1210.8133 1216.1130 1226.7049 1244.8017 1251.5110 1263.3568 1288.9457 1294.1982 1299.0322 1316.1725 1318.7815 1416.7230 1416.7558 1426.6712 1426.7326 1456.4974 1456.6018 1461.9118 1461.9603 1476.5048 1476.5181 1486.3116 1486.4329 1574.2354 1575.7742 2952.9255 2953.0910 2960.0615 2960.1955 3041.1365 3041.1800 3056.6376 3056.8850 3072.4397 3077.6795 3082.1691 3082.5401 3086.3490 3086.4812 3095.8815 3097.0642 3102.5956 3102.6857 3112.4054 3112.4404 3157.8708 3157.9992 3190.0422 3190.1863
redmass: 3.3234 3.5431 3.3630 2.9185 1.0939 1.1307 2.9736 3.4726 3.2206 2.7625 1.9135 1.1105 1.4641 3.0744 3.7378 4.3493 4.0268 4.2478 3.4753 3.3546 3.8264 4.2094 4.1548 3.3612 4.5957 3.7038 4.6546 3.1186 3.5862 5.2191 4.3320 5.1160 4.9003 1.5736 4.3736 1.7187 4.5620 3.9178 4.9617 3.8340 3.0275 3.7564 2.3827 2.7246 1.4608 1.3982 1.8309 5.1118 6.1913 2.2302 4.6223 3.8193 2.2427 2.1699 2.9036 2.2832 2.5886 2.8113 7.8331 6.7346 2.3043 1.5385 2.2524 1.9565 1.8327 2.9813 2.0481 1.8360 1.7674 1.3068 1.5560 1.5350 1.4359 1.9330 1.3930 1.4089 1.4026 1.7005 1.7350 1.5722 1.4000 1.4516 1.7719 1.4828 1.5516 1.4223 1.5778 1.7363 1.4020 1.5818 1.6363 1.7141 1.5235 1.4083 1.1249 1.1250 1.1424 1.1430 1.0586 1.0587 1.0558 1.0559 1.0503 1.0503 1.0510 1.0511 5.8689 5.8950 1.0321 1.0321 1.0353 1.0353 1.1022 1.1022 1.0966 1.0966 1.0872 1.0854 1.0887 1.0879 1.0884 1.0890 1.0891 1.0927 1.1004 1.1004 1.1026 1.1026 1.0875 1.0875 1.1092 1.1092
irintensity: 0.3322 2.4188 0.0237 0.0637 0.2551 0.1153 2.5421 4.1669 0.0855 5.7021 2.3411 1.1024 0.7218 3.7383 0.4063 0.6199 1.6805 25.8437 2.2786 7.9665 2.3169 0.2797 39.9204 0.0452 0.0078 0.2347 4.0006 6.7695 0.6571 16.0494 1.6765 7.8227 0.4654 0.1658 0.2731 193.2302 0.6096 0.2499 8.9871 0.1424 0.0947 7.8158 1.2216 0.0632 0.0030 0.2421 5.6811 3.0816 38.1272 2.2844 11.8530 19.4475 2.4977 30.7680 0.3598 8.7017 2.0853 10.4362 282.0089 82.4112 0.8803 0.1494 140.3983 0.6470 83.0113 4.6739 0.0416 5.7984 37.7324 4.1058 0.8079 3.4258 26.5600 1.5009 7.7522 0.0312 4.9639 2.6876 2.2400 1.9335 49.6786 2.1849 0.0408 0.3968 2.5129 1.1760 18.3787 0.1087 0.5031 7.6875 90.8353 0.8605 2.9097 0.1013 14.4908 1.4231 13.5414 3.7612 7.9512 3.4723 0.9262 10.3592 18.6660 9.6085 2.1414 12.9265 8.0865 0.5112 49.4813 84.7464 38.5207 56.0410 1.4720 73.3882 113.2186 5.0915 3.4311 23.8730 31.3434 13.0437 65.9871 14.3346 12.5627 0.8355 50.6152 11.5152 6.4178 28.2975 0.0298 13.7197 49.8269 0.0550
temp: 298.150 k
press: 1.00000 atm
elementType: 8 8 8 8 6 6 6 6 6 6 6 6 6 6 6 6 6 6 6 6 6 6 1 1 1 1 1 1 1 1 1 1 1 1 1 1 1 1 1 1 1 1 1 1 1 1
symmnumber: 1
zpe: 1002765.9 jmol-1
zpe.correction: 0.381933 hartree
zpe.thermalcorrener: 0.402711 hartree
zpe.thermalcorrenthalpy: 0.403655 hartree
zpe.thermalcorrgfe: 0.334643 hartree
zpe.sumelectzpe: -999.361456 hartree
zpe.sumelectthermal: -999.340678 hartree
zpe.sumelectthermalent: -999.339734 hartree
zpe.sumelectthermalfe: -999.408746 hartree
dipole: -0.0002 -0.0007 0.4004
dipole: 0.4004
quadrupole: -128.6522 -123.5103 -122.3413
quadrupole: -6.5027 0.0019 -0.0016
quadrupole: -3.8176 1.3243 2.4933 -6.5027 0.0019 -0.0016
hfenergy: -999.7433894 hartree
pointgroup: C01 [X(C18H24O4)]
dipole: 0.0000099 -0.0003185 0.1575231 debye
polarizability: 216.8041679|9.3354099|185.4586589|-0.0255856|0.0014176|164.1941591 unknown
InChI: InChI=1S/C18H24O4/c1-19-17(20-2)9-5-6-10(17)14-13(9)15-11-7-8-12(16(14)15)18(11,21-3)22-4/h5-16H,1-4H3
charge 0 multiplicity 1
46 atoms
O  4.037791 -0.073406 -0.151701
O  2.217577 -1.554806 0.131808
O  -4.036869 0.071497 -0.147131
O  -2.217661 1.554145 0.135457
C  0.402277 0.678928 0.781985
C  0.403948 0.678978 -0.800493
C  -0.399804 -0.679722 0.781901
C  -0.403264 -0.678586 -0.800545
C  1.933554 0.69608 1.143355
C  1.93521 0.695482 -1.158636
C  -1.930701 -0.697398 1.145002
C  -1.93494 -0.695087 -1.156978
C  2.589271 -0.156332 -0.007515
C  -2.588268 0.155453 -0.004499
C  2.383296 2.089397 0.6813
C  2.389581 2.086354 -0.685102
C  -2.380635 -2.090478 0.682434
C  -2.388417 -2.086429 -0.683975
C  4.777606 -0.402321 1.072246
C  2.691854 -2.422518 -0.957797
C  -4.775586 0.39894 1.077878
C  -2.694578 2.422365 -0.952587
H  -0.124024 1.514666 1.263478
H  -0.108517 1.51977 -1.290271
H  0.127136 -1.515811 1.262104
H  0.108747 -1.518983 -1.291484
H  2.176677 0.396729 2.173811
H  2.20176 0.415835 -2.188933
H  -2.172716 -0.398867 2.175956
H  -2.202706 -0.414784 -2.186779
H  2.582958 2.932986 1.346689
H  2.609208 2.923323 -1.352544
H  -2.579326 -2.934612 1.347421
H  -2.60854 -2.92296 -1.351803
H  5.826765 -0.534344 0.763358
H  4.398189 -1.33507 1.532874
H  4.712543 0.427624 1.803901
H  3.78266 -2.319107 -1.096864
H  2.181113 -2.187248 -1.91306
H  2.437327 -3.448003 -0.647493
H  -4.396326 1.331601 1.538813
H  -4.709137 -0.431532 1.808811
H  -5.825175 0.530466 0.770239
H  -3.785545 2.318157 -1.089804
H  -2.18535 2.188324 -1.908956
H  -2.440362 3.447803 -0.641874
