program: Gaussian 09
title: 000296919
version: EM64L-G09RevD.01
frameworkgroup: C1[X(C13H13NO)]
method: RPBEPBE
basis: SDD
operation: Freq
keyword: #p
keyword: freq=noraman
keyword: PBEPBE/SDD
title: #p freq=noraman PBEPBE/SDD
converged: YES YES NO NO
title: Mulliken charges:
elementType: O N C C C C C C C C C C C C C H H H H H H H H H H H H H
charge: -0.293335 -0.138233 -0.404130 -0.564847 0.496794 0.194380 -0.145172 -0.423745 -0.392692 -0.333637 -0.257805 -0.224655 -0.227984 -0.145882 -0.241519 0.279108 0.223467 0.262237 0.213408 0.243166 0.229433 0.255088 0.249372 0.233240 0.223788 0.226274 0.235684 0.228197
chargesum: 0.00000
title: Mulliken charges with hydrogens summed into heavy atoms:
elementType: O N C C C C C C C C C C C C C
charge: -0.293335 -0.138233 0.098446 -0.089203 0.496794 0.194380 0.097994 -0.194312 -0.137604 -0.084265 -0.024564 -0.000867 -0.001710 0.089802 -0.013322
polarizability: 2.09023738e+02 6.73241089e+00 1.53771624e+02 -1.61983217e+01 -3.80160609e-01 7.27942042e+01
1716.lowfreq: -4.3311 -1.1124 -0.0008 -0.0006 -0.0002 8.3603 27.2697 28.7521 54.1566
frequency: 26.3383 28.4915 54.1064 85.2355 108.9741 160.3040 243.1571 295.5773 327.5454 364.6062 404.4194 425.5889 463.6022 502.6448 526.9591 538.0099 572.0097 609.9895 617.6046 705.3800 718.0869 730.6829 756.2222 760.5606 791.0553 823.0685 844.8211 857.3672 873.4434 922.1199 927.4522 978.6286 983.3479 989.1887 991.5667 995.5135 1021.5504 1026.0130 1028.6530 1073.2786 1105.9858 1127.7942 1169.8791 1172.1787 1187.4967 1191.5026 1217.8032 1224.2385 1275.0174 1301.1024 1329.0638 1347.1180 1358.3384 1382.8730 1385.1374 1441.5346 1444.1780 1461.0398 1481.4417 1484.7928 1542.4432 1565.6454 1593.4196 1614.4984 1650.2622 3001.1589 3024.1027 3061.7874 3097.9335 3112.7778 3119.7621 3132.3166 3138.6897 3144.4291 3151.1633 3162.4653 3179.9281 3192.5959
redmass: 4.3983 4.3987 4.4901 3.3822 5.0531 5.7130 4.8023 3.3418 2.3849 3.2043 2.8340 3.7183 5.2612 3.0813 2.9338 5.5384 6.6179 5.6244 6.3445 2.0600 2.7265 3.2860 1.4887 1.9031 1.3613 3.1369 1.5248 1.2485 4.3826 1.4940 1.3520 1.3851 1.3071 4.2719 2.6845 1.3326 2.9145 2.2444 2.6715 1.8508 1.6856 1.5042 2.3198 1.0706 1.1162 1.1560 2.2839 1.9444 1.3386 1.3628 1.2631 1.4404 1.3795 6.8652 1.7327 2.1555 1.6423 1.4411 1.2779 1.8023 6.9321 5.2029 6.0386 6.1266 7.0348 1.0600 1.0604 1.1007 1.1060 1.0874 1.0869 1.0910 1.0889 1.0959 1.0906 1.1015 1.0945 1.0997
irintensity: 1.9218 1.3295 0.7377 1.3630 0.3912 3.0665 1.4442 2.1564 1.2999 6.1018 0.0630 7.0976 8.5191 33.7494 1.0216 1.9541 2.5168 1.7599 0.0812 39.6863 10.9919 14.6070 82.3018 49.7433 1.7576 0.9124 9.9403 0.0366 9.1204 1.9989 0.6400 0.0404 0.5986 0.4584 1.9437 0.1004 5.0062 10.9341 4.4862 4.7165 2.1637 37.2839 29.4886 0.6369 0.0744 12.2392 0.4841 4.4440 4.5476 4.7673 0.5494 36.3608 11.6939 0.2153 9.8145 5.6876 7.9027 23.4976 17.4922 17.2066 36.5248 160.1595 1.1630 11.0149 234.1967 17.5007 30.6732 3.9393 5.0183 10.5184 2.8361 11.5334 15.5832 38.4961 4.8812 25.9582 7.9283 7.8862
temp: 298.150 k
press: 1.00000 atm
elementType: 8 7 6 6 6 6 6 6 6 6 6 6 6 6 6 1 1 1 1 1 1 1 1 1 1 1 1 1
symmnumber: 1
zpe: 596500.3 jmol-1
zpe.correction: 0.227195 hartree
zpe.thermalcorrener: 0.239854 hartree
zpe.thermalcorrenthalpy: 0.240798 hartree
zpe.thermalcorrgfe: 0.185835 hartree
zpe.sumelectzpe: -632.098080 hartree
zpe.sumelectthermal: -632.085421 hartree
zpe.sumelectthermalent: -632.084477 hartree
zpe.sumelectthermalfe: -632.139440 hartree
dipole: -0.6066 -4.0438 -0.4192
dipole: 4.1105
quadrupole: -73.3461 -86.6708 -92.5505
quadrupole: 6.3689 -3.0724 0.2127
quadrupole: 10.8430 -2.4816 -8.3614 6.3689 -3.0724 0.2127
hfenergy: -632.3252747 hartree
pointgroup: C01 [X(C13H13N1O1)]
dipole: -0.2213575 1.5871272 0.2175673 debye
polarizability: 208.5730368|-7.9636857|153.885634|17.0841805|2.1372531|73.1308955 unknown
InChI: InChI=1S/C13H13NO/c15-13-8-4-5-10-14(13)11-9-12-6-2-1-3-7-12/h1-8,10H,9,11H2
charge 0 multiplicity 1
28 atoms
O  -1.664411 -2.051465 -0.098585
N  -1.766506 0.262549 0.331935
C  -0.309807 0.23042 0.613822
C  0.535964 0.276128 -0.689486
C  2.01885 0.143911 -0.379446
C  -2.377899 -0.996134 -0.043012
C  -2.470988 1.449884 0.38771
C  2.864814 1.28096 -0.330599
C  2.574846 -1.130951 -0.093749
C  -3.802718 -0.909553 -0.324944
C  -3.827474 1.506176 0.101542
C  4.2350 1.150723 -0.006554
C  3.943039 -1.265022 0.229944
C  -4.498695 0.291074 -0.260466
C  4.778205 -0.123635 0.275756
H  -0.096145 -0.713532 1.142811
H  -0.055397 1.079416 1.273052
H  0.201113 -0.558625 -1.330978
H  0.331607 1.222673 -1.224623
H  -1.896929 2.336021 0.676274
H  2.450509 2.271838 -0.556977
H  1.930568 -2.018106 -0.136451
H  -4.292419 -1.848457 -0.597553
H  -4.357271 2.459191 0.159936
H  4.87719 2.038533 0.021067
H  4.358919 -2.256508 0.442181
H  -5.570851 0.312515 -0.486677
H  5.840483 -0.227225 0.52407
