program: Gaussian 09
title: 000296911
version: EM64L-G09RevD.01
frameworkgroup: C1[X(C8H12O)]
method: RPBEPBE
basis: SDD
operation: Freq
keyword: #pfreq=noraman
keyword: PBEPBE/SDD
title: #p freq=noraman PBEPBE/SDD
converged: NO YES NO NO
title: Mulliken charges:
elementType: O C C C C C C C C H H H H H H H H H H H H
charge: -0.443700 -0.129139 -0.252431 -0.259372 -0.451276 -0.457667 -0.234539 -0.236641 -0.376926 0.233715 0.244063 0.229789 0.228944 0.222545 0.223689 0.228514 0.238505 0.238442 0.207788 0.213271 0.332427
chargesum: 0.00000
title: Mulliken charges with hydrogens summed into heavy atoms:
elementType: O C C C C C C C C
charge: -0.111273 0.104576 -0.008368 -0.029583 0.000213 -0.005464 0.003966 0.001800 0.044133
polarizability: 8.10707880e+01 -7.42228717e-01 7.87698853e+01 2.39245335e+00 -2.92887709e+00 8.05463510e+01
1716.lowfreq: -24.0851 -18.6358 0.0001 0.0003 0.0005 18.9040 69.9792 164.3183 236.5066
frequency: 69.8801 164.2404 236.4932 247.0920 308.0217 340.4669 410.8283 473.0367 528.2997 680.4010 718.6498 745.0157 789.0255 800.6342 844.2890 866.7789 876.0665 917.3884 934.1826 946.0631 959.8770 969.0498 976.1529 1009.9494 1052.3196 1079.4597 1082.0363 1126.0380 1137.3392 1156.2465 1174.5266 1194.4903 1208.4824 1254.7854 1265.2331 1275.7761 1280.9420 1307.0028 1322.8763 1355.4401 1377.4975 1463.8532 1470.9859 1477.3336 1580.8583 2985.5385 3003.0177 3011.6157 3017.9411 3058.6412 3067.0417 3070.5360 3078.0906 3088.6813 3153.1554 3186.5598 3567.2814
redmass: 3.0331 4.0038 2.0078 1.7780 1.2363 3.0552 3.1190 3.0030 3.0744 4.1796 1.4725 2.7948 2.1553 2.2713 2.3063 1.9341 2.7927 1.4984 1.9301 3.0823 2.7313 2.3549 2.6208 1.8999 1.5195 1.2131 1.3574 1.2159 1.2033 1.7499 1.6468 1.3235 1.3305 1.3027 1.3993 1.6725 1.4525 1.3164 1.7012 1.2732 1.3290 1.0802 1.0811 1.1004 5.7257 1.0643 1.0600 1.0832 1.0633 1.0884 1.1035 1.1003 1.0917 1.1051 1.0871 1.1094 1.0660
irintensity: 3.2907 1.1885 14.0339 2.1668 128.0937 20.1226 0.3979 0.3295 10.8382 0.9041 68.1049 5.4430 2.7524 1.5032 16.6615 10.5169 6.7681 0.9699 8.1383 56.1044 0.7967 3.9554 20.8422 0.4586 3.6001 13.6051 14.2716 7.3966 13.6426 3.7806 8.7240 1.5802 0.4375 0.1925 1.3528 2.2215 5.6916 13.1122 6.5702 11.0864 17.6041 3.3684 5.8216 4.2594 1.9605 34.2686 27.5193 19.7646 71.0578 65.0304 0.2910 14.9595 35.3303 65.8866 7.5877 20.6225 5.2997
temp: 298.150 k
press: 1.00000 atm
elementType: 8 6 6 6 6 6 6 6 6 1 1 1 1 1 1 1 1 1 1 1 1
symmnumber: 1
zpe: 476972.1 jmol-1
zpe.correction: 0.181669 hartree
zpe.thermalcorrener: 0.189722 hartree
zpe.thermalcorrenthalpy: 0.190666 hartree
zpe.thermalcorrgfe: 0.149144 hartree
zpe.sumelectzpe: -386.522169 hartree
zpe.sumelectthermal: -386.514116 hartree
zpe.sumelectthermalent: -386.513172 hartree
zpe.sumelectthermalfe: -386.554695 hartree
dipole: -2.2499 0.2475 0.6754
dipole: 2.3621
quadrupole: -64.7457 -53.6813 -50.4999
quadrupole: 0.9833 3.0645 -1.6632
quadrupole: -8.4367 2.6277 5.8091 0.9833 3.0645 -1.6632
hfenergy: -386.7038381 hartree
pointgroup: C01 [X(C8H12O1)]
dipole: 0.8927617 -0.1268612 0.2247846 debye
dipolederiv: -0.7904838 -0.0026922 0.2206277 0.0317547 -0.5505626 -0.0650446 0.3418583 -0.0824894 -0.2765032 -0.0627127 0.0014042 0.0702929 -0.0756881 0.0531415 -0.1063268 0.0586938 -0.0815031 -0.0069989 -0.0141232 0.0188665 0.0760498 0.0182769 -0.0160763 0.0938719 -0.0353937 0.0220312 0.1796175 0.03487 -0.1031957 -0.0923352 -0.0183503 0.028515 0.0656513 -0.0656024 0.0915733 0.0413513 0.0733956 -0.037748 -0.0307594 -0.0333367 0.0767096 -0.0493616 0.0457077 -0.0175907 -0.0279795 0.0545031 0.0316398 0.0831506 -0.0262937 0.0423328 -0.0485511 0.0274897 -0.0592828 0.042161 -0.194375 -0.1273515 -0.0910022 -0.1337589 0.0015713 -0.068302 -0.0200258 -0.1323983 0.0162458 -0.2799114 -0.0791373 0.094946 -0.1210352 0.081422 -0.0548036 0.0364987 0.0201699 -0.0257874 0.5437631 -0.1041444 -0.1150256 -0.0216415 0.3692802 0.0698143 -0.2111625 0.074285 0.339333 0.0426653 0.0022227 -0.0158478 0.0078357 -0.1356121 0.100972 -0.0340282 0.0883077 0.025636 0.0628049 -0.0160824 -0.0377664 -0.0058611 0.0264129 -0.0738764 -0.0156936 -0.0728562 -0.1556432 -0.0163238 0.0665037 0.1184803 0.0561661 0.003404 -0.0731086 0.1044129 -0.0761165 -0.0787796 0.0567324 -0.0045756 0.0140264 -0.0435686 -0.0624308 0.1609397 0.0334167 0.1003172 -0.0704326 -0.156196 0.0620252 0.0317308 0.0919922 0.0296255 -0.0329739 -0.0035983 -0.0015185 0.0576007 -0.0850417 -0.0131061 -0.1113542 0.0165549 0.0706861 0.0257292 -0.108994 -0.0238905 -0.0535071 0.0620319 0.0189357 -0.003605 0.0051619 -0.1972817 -0.0236535 0.0015351 0.0479417 0.0628968 0.1404392 0.1235552 0.0179062 0.1061678 -0.0704372 -0.0013404 0.0239917 -0.0111985 0.082521 0.1730594 0.0580727 -0.038151 0.047591 0.0418795 0.0737503 -0.0293042 0.0936224 -0.068181 0.0393632 0.0660711 0.033603 0.019106 -0.1663937 0.0242282 0.0580579 0.0765105 0.0182887 -0.0135888 0.0038716 -0.0592775 0.0142639 0.0753824 -0.0152632 -0.0687026 -0.0470488 -0.1272517 0.3291282 0.0348648 -0.1656895 0.0646631 0.2984316 -0.0023513 -0.1391572 -0.0088659 0.0254125 unknown
polarizability: 80.9548413|-0.2501983|77.8877498|-2.5006392|2.4773165|81.5444333 unknown
InChI: InChI=1S/C8H12O/c9-5-8-6-1-2-7(8)4-3-6/h1-2,6-9H,3-5H2
charge 0 multiplicity 1
21 atoms
O  -2.980237 0.454098 0.210669
C  -0.572233 0.369591 -0.44501
C  0.623672 -0.434161 -1.062654
C  0.125759 0.489529 0.958465
C  1.792503 0.610344 -0.854247
C  1.445002 1.253948 0.536759
C  0.840494 -1.518248 0.001712
C  0.545696 -0.963003 1.213927
C  -1.938487 -0.325558 -0.488939
H  -0.673427 1.367703 -0.914565
H  0.508597 -0.784776 -2.100115
H  -0.431941 0.991549 1.765879
H  1.779319 1.365603 -1.660944
H  2.779982 0.118961 -0.861348
H  2.2464 1.117008 1.282003
H  1.246503 2.337098 0.441463
H  1.263974 -2.507643 -0.191493
H  0.6808 -1.412332 2.201646
H  -1.871898 -1.352904 -0.079028
H  -2.304312 -0.38189 -1.528517
H  -2.735765 0.511784 1.168536
