program: Gaussian 09
title: 000296910
version: EM64L-G09RevD.01
frameworkgroup: C1[X(C9H14O)]
method: RPBEPBE
basis: SDD
operation: Freq
keyword: #pfreq=noraman
keyword: PBEPBE/SDD
title: #p freq=noraman PBEPBE/SDD
converged: YES YES NO NO
title: Mulliken charges:
elementType: O C C C C C C C C C H H H H H H H H H H H H H H
charge: -0.451829 0.306785 -0.247483 -0.177107 -0.507625 -0.487453 -0.448523 -0.186778 -0.220421 -0.782223 0.241052 0.213912 0.205924 0.229543 0.230141 0.219148 0.205857 0.224585 0.223720 0.224369 0.236316 0.222520 0.206664 0.318906
chargesum: 0.00000
title: Mulliken charges with hydrogens summed into heavy atoms:
elementType: O C C C C C C C C C
charge: -0.132923 0.306785 -0.006431 0.036805 -0.072158 -0.038164 -0.018081 0.036941 0.003948 -0.116723
polarizability: 9.49516955e+01 2.47850989e+00 8.84964479e+01 -2.40930797e+00 9.16573366e-01 8.87144346e+01
1716.lowfreq: -26.9295 -18.4728 -0.0003 0.0004 0.0004 27.8797 88.7008 230.5352 238.1892
frequency: 88.2963 230.5289 238.1879 264.3775 276.5920 329.4176 351.9249 382.2949 401.7342 422.8021 460.2845 557.0358 611.3164 632.7422 686.9397 718.5850 807.3585 815.3076 843.0946 871.4500 885.9101 935.2940 939.4310 952.9680 965.5881 982.3787 1006.0155 1038.6027 1062.8783 1079.3972 1105.0523 1115.1959 1126.6623 1163.6266 1178.1514 1220.9198 1231.5329 1239.1653 1272.9458 1292.4532 1298.1439 1318.4707 1336.2642 1340.3804 1361.3893 1387.6128 1450.2147 1463.3336 1465.7512 1475.7452 1490.5426 1631.9326 2970.5202 2982.4136 2984.6531 3007.1733 3033.4436 3042.8721 3049.2004 3050.5772 3058.3376 3068.2506 3086.4617 3131.5014 3166.8305 3535.6289
redmass: 2.6969 1.4769 2.9963 1.1937 1.3322 2.5269 2.3338 2.1591 2.6541 3.1527 3.4275 3.6534 5.2515 3.5230 2.1301 2.1988 1.6399 2.0953 2.6563 2.5306 2.1401 1.8964 1.3800 1.9438 3.5509 1.9819 2.0359 2.1501 1.7259 1.9638 1.2936 1.7523 1.1848 1.2620 1.5701 1.4106 1.1718 1.6605 1.5835 1.3243 1.3428 1.4917 1.5155 1.8101 1.7525 1.2150 1.0903 1.0623 1.0611 1.0727 1.0826 5.9954 1.0377 1.0620 1.0605 1.0626 1.0879 1.0997 1.0876 1.1023 1.0962 1.1027 1.0999 1.0871 1.1050 1.0658
irintensity: 0.3984 2.9247 3.6556 37.0510 87.7370 6.2546 5.3382 0.3522 2.7687 0.6663 5.1391 1.3936 2.7083 0.8693 27.9151 39.1341 4.9077 4.8560 27.1072 5.7597 5.5369 1.5721 1.0508 3.5978 0.9271 1.8688 4.3084 2.6868 49.9318 22.6471 16.9519 11.4540 5.0938 6.7385 10.4811 2.3625 0.9764 11.6964 4.1971 5.6803 3.8210 9.2442 0.4924 12.8426 7.1199 16.1998 7.5296 8.9222 6.4038 6.1519 7.8241 2.6860 21.2820 31.9444 45.2720 52.4612 69.9822 14.6065 23.8337 18.0354 48.0572 51.9543 33.0941 11.3311 33.7359 2.1347
temp: 298.150 k
press: 1.00000 atm
elementType: 8 6 6 6 6 6 6 6 6 6 1 1 1 1 1 1 1 1 1 1 1 1 1 1
symmnumber: 1
zpe: 550115.2 jmol-1
zpe.correction: 0.209528 hartree
zpe.thermalcorrener: 0.218621 hartree
zpe.thermalcorrenthalpy: 0.219565 hartree
zpe.thermalcorrgfe: 0.176499 hartree
zpe.sumelectzpe: -425.766658 hartree
zpe.sumelectthermal: -425.757565 hartree
zpe.sumelectthermalent: -425.756620 hartree
zpe.sumelectthermalfe: -425.799686 hartree
dipole: 0.1154 1.4646 1.3465
dipole: 1.9929
quadrupole: -59.3641 -62.9023 -58.8101
quadrupole: 1.8804 2.4149 -1.5347
quadrupole: 0.9947 -2.5435 1.5488 1.8804 2.4149 -1.5347
hfenergy: -425.9761856 hartree
pointgroup: C01 [X(C9H14O1)]
dipole: 0.0612934 0.5706866 0.5341567 debye
dipolederiv: -0.6217006 0.1648193 0.198621 0.1685814 -0.720818 0.0623608 0.2094598 0.0755389 -0.2532918 0.5743839 -0.0979518 -0.0580937 -0.1495929 0.5184756 -0.0119254 0.0052496 -0.0358332 0.2365905 0.0328136 -0.0245891 -0.0848788 -0.0644197 -0.0454496 -0.0567462 -0.089964 -0.0310572 0.1170174 0.13267 -0.0547643 -0.0741466 -0.0434696 -0.0092168 -0.025053 -0.0576048 -0.0134379 0.1799283 -0.1039845 0.0252713 0.0829205 0.0025177 0.0477072 0.0100169 0.1101755 0.0016483 -0.0507082 0.0449796 0.0112732 0.0745479 0.044957 0.0733325 0.007194 0.0239935 0.0238926 0.0585738 0.1094419 0.0208394 0.0056088 0.0218032 0.0710334 0.0493362 0.0458655 0.010775 -0.0037043 -0.0346042 0.1500432 -0.0787704 0.1438752 0.0576934 0.1231605 -0.1011744 0.0491532 -0.0837148 -0.1804109 0.1316716 -0.0563725 0.1675041 0.0186302 0.0959849 -0.038234 0.1361459 -0.0492071 -0.0899775 -0.1296299 0.0115035 -0.0427707 -0.1139282 0.0030408 -0.0275034 -0.0363765 0.0631917 -0.0155375 0.0029667 0.1150204 0.0053222 0.0528571 -0.0077145 0.1013532 0.0044024 -0.1094671 -0.0511412 -0.0066669 0.1200982 -0.0093931 0.0487402 0.0247166 0.1195058 0.0183602 -0.1396329 0.0177201 -0.0489684 -0.0572302 -0.0566057 -0.0819471 -0.1591226 -0.0361681 -0.096007 -0.0298615 0.0073711 0.0593371 -0.0229215 0.0650725 -0.0643669 0.1302829 -0.027456 0.0707617 -0.0050491 -0.0496996 0.0322371 -0.1177215 0.0095406 0.0726909 -0.0191091 -0.0861989 0.0317485 -0.0956468 0.009315 -0.1139906 0.0537668 -0.1205219 -0.1388365 0.0569232 0.0280267 -0.0086767 0.0538549 0.0609993 -0.0784568 -0.0441409 -0.0111156 -0.1219521 -0.1277135 -0.0020122 -0.1054534 -0.034515 -0.1902566 0.0710499 -0.0091546 0.0178451 0.0612641 0.0217777 -0.0432935 0.0128019 0.0397497 0.108071 -0.0535926 0.0359509 -0.0740037 -0.0234316 -0.1206685 0.0128331 -0.1285133 0.0087777 0.038009 -0.1528401 0.0524744 -0.149289 -0.0303684 -0.009756 0.0700316 0.00855 0.0761293 0.0208957 -0.0268734 0.0790006 -0.0134049 0.0832378 -0.0084149 0.1406708 0.0323647 -0.0895073 0.0467732 0.1188327 0.0253732 0.0919395 -0.1105485 -0.0166917 0.032712 -0.0184645 0.0805867 -0.0647703 -0.0201926 -0.1056903 0.0246481 0.0599221 0.0473111 -0.1604932 0.0118428 -0.0574691 0.1986394 0.0201751 -0.1457649 -0.0290199 0.295279 -0.0691899 -0.2297745 -0.0141662 0.0873747 unknown
polarizability: 94.9691682|2.4069257|88.4017927|-2.4508757|0.9222652|88.791617 unknown
InChI: InChI=1S/C9H14O/c1-9(10)6-7-2-4-8(9)5-3-7/h2,4,7-8,10H,3,5-6H2,1H3
charge 0 multiplicity 1
24 atoms
O  1.928725 -1.259168 -0.096535
C  1.150141 -0.00455 0.094337
C  0.148856 0.00541 -1.109298
C  -1.214701 -0.048373 1.104867
C  0.317105 -0.042949 1.423937
C  -0.749026 1.284947 -1.016794
C  -1.531191 1.27959 0.337477
C  -0.771327 -1.198922 -0.974408
C  -1.499766 -1.218502 0.174946
C  2.138558 1.181324 0.063856
H  0.722738 -0.009882 -2.052081
H  -1.799431 -0.10414 2.0406
H  0.556714 0.830912 2.060861
H  0.572826 -0.959157 1.987694
H  -1.451447 1.273687 -1.86877
H  -0.135785 2.198784 -1.120192
H  -1.237521 2.141022 0.969056
H  -2.618824 1.358421 0.163024
H  -0.817113 -1.972711 -1.746431
H  -2.213701 -2.006591 0.437292
H  2.686673 1.201109 -0.895092
H  1.62846 2.151095 0.200571
H  2.880383 1.084845 0.881383
H  2.588653 -1.327502 0.641399
