program: Gaussian 09
title: 000296900
version: EM64L-G09RevD.01
frameworkgroup: C1[X(C6H6O2)]
method: RPBEPBE
basis: SDD
operation: Freq
keyword: #p
keyword: freq=noraman
keyword: PBEPBE/SDD
title: #p freq=noraman PBEPBE/SDD
converged: YES YES NO NO
title: Mulliken charges:
elementType: O O C C C C C C H H H H H H
charge: -0.419538 -0.219941 -0.261423 -0.261553 -0.240848 -0.203319 -0.239158 0.154081 0.261922 0.267128 0.279537 0.254713 0.251677 0.376723
chargesum: 0.00000
title: Mulliken charges with hydrogens summed into heavy atoms:
elementType: O O C C C C C C
charge: -0.042815 -0.219941 0.000499 0.005575 0.038689 0.051394 0.012519 0.154081
polarizability: 6.82988978e+01 -3.29767644e+00 6.38139505e+01 1.29404360e+00 -2.35336838e+00 5.69262696e+01
1716.lowfreq: -2.4122 -0.0005 -0.0003 -0.0001 8.1715 12.0626 49.1488 160.2382 177.8004
frequency: 49.0952 160.2360 177.7945 356.9268 412.6409 463.2684 598.9367 621.9049 681.1076 725.9228 770.4317 795.4787 827.1111 855.3415 886.2880 893.3566 926.0435 997.9179 1002.0227 1027.0136 1046.3285 1098.0062 1129.3581 1185.1148 1242.7904 1255.3696 1263.6616 1392.3381 1541.4698 1661.8249 3111.4975 3168.8675 3179.7813 3190.7120 3217.0988 3509.3925
redmass: 6.6902 5.5404 3.8525 4.8761 3.6185 3.3969 1.2679 3.3798 3.6340 1.6482 1.9926 1.7046 4.3297 2.3827 2.1381 2.5241 1.9325 1.4860 1.5323 2.0627 1.4598 1.4562 1.6250 1.3085 1.6262 2.4369 1.7763 2.5897 5.5739 8.9358 1.0865 1.0857 1.0921 1.0977 1.1192 1.0640
irintensity: 0.4560 1.8516 0.5251 9.5253 3.6659 26.3218 121.7214 40.1434 18.7990 76.9180 25.8159 19.6917 11.5579 9.9219 9.2243 8.1961 8.8462 7.2089 71.4969 174.9992 17.2607 61.1355 3.7813 0.6971 2.9110 5.7578 29.1176 79.8289 9.7633 196.8423 5.3033 0.7692 13.0816 17.4193 9.6282 20.0032
temp: 298.150 k
press: 1.00000 atm
elementType: 8 8 6 6 6 6 6 6 1 1 1 1 1 1
symmnumber: 1
zpe: 271686.6 jmol-1
zpe.correction: 0.103480 hartree
zpe.thermalcorrener: 0.110528 hartree
zpe.thermalcorrenthalpy: 0.111472 hartree
zpe.thermalcorrgfe: 0.071699 hartree
zpe.sumelectzpe: -381.988180 hartree
zpe.sumelectthermal: -381.981132 hartree
zpe.sumelectthermalent: -381.980188 hartree
zpe.sumelectthermalfe: -382.019961 hartree
dipole: -0.0878 -1.5717 0.0903
dipole: 1.5767
quadrupole: -42.8905 -47.9220 -43.5517
quadrupole: 0.3576 2.0200 2.5904
quadrupole: 1.8976 -3.1339 1.2363 0.3576 2.0200 2.5904
hfenergy: -382.0916598 hartree
pointgroup: C01 [X(C6H6O2)]
dipole: 0.0422115 0.3622789 -0.5017699 debye
dipolederiv: -0.9676416 0.4400694 -0.2014936 0.5164644 -0.7422864 0.0533382 -0.0698528 -0.0086265 -0.2981817 -0.5457291 -0.014755 0.1497002 0.1538856 -0.6029857 0.2161006 0.1387725 0.360013 -0.6826649 0.0007161 -0.0636181 -0.0492215 0.0323506 -0.1660174 0.0570067 -0.0684982 0.0777808 -0.0363032 0.2519387 0.0793619 -0.0916787 -0.0120134 -0.1513014 -0.1130663 -0.0218455 -0.1090852 -0.0346565 -0.4130158 0.0054199 0.1668522 -0.1535727 0.0460325 0.0862323 0.2150468 0.0302111 -0.0620673 -0.1251244 0.1400099 0.1127113 0.2163152 0.0485109 -0.0228067 0.1840733 -0.1930523 0.1153205 -0.2634687 -0.1021904 0.1140788 -0.1939895 -0.0229928 0.0036655 0.2247035 0.1598149 0.1236569 1.2794371 -0.4758479 -0.1876528 -0.5960468 0.8966417 -0.3993484 -0.5011923 -0.4365553 0.8179575 0.0707497 0.0594254 0.019871 0.0699376 0.0641355 -0.0754236 -0.0003261 -0.0975556 -0.0349113 0.039049 -0.0627225 0.0124409 -0.047122 0.0377353 0.0810864 0.0013615 0.1101562 -0.0099113 0.008828 0.0140966 -0.0590877 0.0502963 0.1620426 0.0208529 -0.040505 0.0279795 -0.0466071 0.1921288 -0.020541 -0.0403982 0.0101451 0.0421153 0.0875922 -0.0896115 0.1109623 0.008877 0.1978775 0.0041175 -0.0508693 -0.0107773 0.0583153 -0.0841449 -0.1146467 -0.1009388 -0.0343596 0.2742548 -0.0028259 0.1047474 -0.0358731 0.3300546 0.088915 0.1425206 0.068896 0.1738509 unknown
polarizability: 67.589228|-4.0881726|62.0803468|0.7982337|-4.0011561|59.3695432 unknown
InChI: InChI=1S/C6H6O2/c7-6(8)5-3-1-2-4(3)5/h1-5,7H
charge 0 multiplicity 1
14 atoms
O  -2.219462 0.99552 -0.029466
O  -1.277798 -0.741393 1.196763
C  1.119992 -0.735671 -0.826516
C  1.199132 0.810992 -0.684039
C  -0.184076 0.084019 -0.862808
C  1.684352 -0.796992 0.611459
C  1.758801 0.566908 0.729386
C  -1.226777 0.024275 0.210124
H  1.437493 -1.333695 -1.682183
H  1.533821 1.53702 -1.426638
H  -0.614235 0.246537 -1.860237
H  1.795422 -1.62807 1.30885
H  1.957483 1.247999 1.558845
H  -2.902047 0.941551 0.693762
