program: Gaussian 09
title: 000296887
version: EM64L-G09RevD.01
frameworkgroup: C1[X(C12H12O4)]
method: RPBEPBE
basis: SDD
operation: Freq
keyword: #pfreq=noraman
keyword: PBEPBE/SDD
title: #p freq=noraman PBEPBE/SDD
converged: YES YES NO NO
title: Mulliken charges:
elementType: O O O O C C C C C C C C C C C C H H H H H H H H H H H H
charge: -0.431209 -0.240988 -0.426123 -0.242617 -0.162888 -0.206478 -0.370528 -0.244572 -0.529567 -0.565496 0.372420 -0.321513 -0.366975 0.277676 0.012559 0.061113 0.262744 0.258334 0.291492 0.255168 0.245618 0.256889 0.249294 0.245736 0.275967 0.279510 0.382793 0.381641
chargesum: 0.00000
title: Mulliken charges with hydrogens summed into heavy atoms:
elementType: O O O O C C C C C C C C C C C C
charge: -0.048416 -0.240988 -0.044482 -0.242617 0.099856 0.051856 -0.079036 0.010596 -0.027060 -0.070466 0.372420 -0.045545 -0.087465 0.277676 0.012559 0.061113
polarizability: 1.87808919e+02 -2.03009870e-01 1.37640918e+02 -7.27204839e+00 5.19767220e+00 8.63887978e+01
1716.lowfreq: -21.2130 -7.7835 -0.0009 -0.0008 -0.0007 3.4116 52.1820 54.0103 63.2755
frequency: 52.1711 54.0024 63.1730 79.3753 103.5437 167.2401 186.0355 262.5502 293.2461 306.4825 367.7381 387.8317 432.4107 466.6260 484.6927 518.9143 533.8835 571.2036 604.4757 615.1964 629.1055 655.8094 702.9515 719.1090 763.9127 780.1247 795.7762 830.5501 843.3016 871.4241 888.6726 906.8058 912.0058 924.2067 934.7890 977.4924 991.6869 1012.3287 1020.4473 1022.9026 1026.7297 1059.9003 1098.3164 1117.2255 1122.7465 1145.5418 1160.1214 1182.9614 1220.5927 1225.7740 1242.6111 1253.7107 1256.4440 1260.9661 1285.3805 1289.7942 1297.9219 1310.4372 1339.1422 1351.6753 1461.0580 1481.4669 1578.7177 1633.4107 1639.3705 1648.5445 2996.7951 3016.8284 3028.2691 3041.4577 3062.8576 3091.0704 3098.5097 3106.2213 3159.6764 3187.8588 3518.4469 3528.3742
redmass: 9.7866 7.8624 6.5013 5.9523 5.8365 4.8035 3.5573 6.1785 4.5135 3.4522 5.4990 2.7930 3.0705 3.3020 5.9608 2.6438 3.3291 1.4554 1.2408 3.2878 3.7136 3.4313 4.2733 4.9625 4.2267 3.7800 3.5462 3.1783 4.6458 3.0364 1.9819 2.2179 1.9713 2.1628 2.2655 2.1161 2.4064 3.0205 2.1192 1.7743 1.7856 2.0897 1.1578 1.3765 1.5126 1.6620 1.2643 1.6304 1.2606 1.4882 1.5722 1.5247 1.3721 1.6395 1.7169 1.6593 1.7410 1.7978 2.9922 4.1695 1.0935 1.0980 7.7779 7.9007 8.1960 8.1802 1.0616 1.0853 1.0597 1.0979 1.0907 1.0896 1.1059 1.0923 1.0958 1.0983 1.0640 1.0642
irintensity: 2.1591 0.7827 0.3241 0.6917 0.3151 0.0343 1.8850 2.3633 1.7142 2.8109 26.4237 7.3302 8.7329 16.4975 3.1241 8.7063 6.5817 97.0303 98.3005 43.0222 35.6793 24.0266 25.6314 79.1134 0.6431 2.3454 5.0034 12.7702 10.9227 6.5827 16.9479 12.0742 8.6408 5.7014 13.5529 60.4160 195.8684 238.9328 9.2342 15.4772 21.2361 3.7523 1.1647 11.4339 122.1057 54.2712 26.2364 18.1125 2.5899 6.9744 3.7058 6.0500 0.4038 7.2367 3.2577 18.9434 40.9248 24.9207 40.4843 62.3571 8.1522 12.6132 69.2345 108.0209 368.7932 184.8184 15.1724 16.3783 25.6104 4.4737 36.6141 32.4440 27.0395 5.5574 3.3731 2.0985 39.0262 41.6175
temp: 298.150 k
press: 1.00000 atm
elementType: 8 8 8 8 6 6 6 6 6 6 6 6 6 6 6 6 1 1 1 1 1 1 1 1 1 1 1 1
symmnumber: 1
zpe: 569788.0 jmol-1
zpe.correction: 0.217021 hartree
zpe.thermalcorrener: 0.230397 hartree
zpe.thermalcorrenthalpy: 0.231342 hartree
zpe.thermalcorrgfe: 0.176072 hartree
zpe.sumelectzpe: -764.187933 hartree
zpe.sumelectthermal: -764.174556 hartree
zpe.sumelectthermalent: -764.173612 hartree
zpe.sumelectthermalfe: -764.228881 hartree
dipole: 0.8046 -1.0657 -0.1767
dipole: 1.3470
quadrupole: -95.8371 -95.0706 -89.9767
quadrupole: -13.8095 -4.7955 0.1996
quadrupole: -2.2090 -1.4425 3.6514 -13.8095 -4.7955 0.1996
hfenergy: -764.4049534 hartree
pointgroup: C01 [X(C12H12O4)]
dipole: 0.3091398 0.425236 0.0665886 debye
polarizability: 187.4722779|1.005755|137.859468|9.1583021|4.2316792|86.5068881 unknown
InChI: InChI=1S/C12H12O4/c13-11(14)6-3-7-5-1-9(8(7)4-6)10(2-5)12(15)16/h2-3,5,7-9,13,15H,1,4H2
charge 0 multiplicity 1
28 atoms
O  4.581428 0.258609 0.609632
O  3.695328 -1.845605 0.149903
O  -4.126379 -1.600148 -0.273583
O  -4.661547 0.64541 0.024688
C  0.039861 -0.567953 0.521539
C  -0.266837 0.975271 0.725118
C  1.049908 -0.55575 -0.694292
C  0.593535 1.668823 -0.435692
C  0.460911 0.59754 -1.565334
C  -1.334042 -1.250096 0.21601
C  2.322872 0.126021 -0.179202
C  2.047953 1.461171 -0.024988
C  -1.759273 1.09178 0.533269
C  -2.341583 -0.109546 0.245896
C  3.543053 -0.597009 0.190278
C  -3.790352 -0.259888 0.002361
H  0.513065 -1.021491 1.407547
H  0.047739 1.372042 1.707673
H  1.197998 -1.537634 -1.164965
H  0.288164 2.700711 -0.663186
H  -0.581226 0.429588 -1.885907
H  1.085745 0.8311 -2.443622
H  -1.588172 -2.021117 0.965805
H  -1.337508 -1.76401 -0.764099
H  2.711205 2.21529 0.405256
H  -2.312103 2.034304 0.606307
H  5.375185 -0.297119 0.835042
H  -5.108231 -1.657097 -0.427456
