program: Gaussian 09
title: 000296866
version: EM64L-G09RevD.01
frameworkgroup: C1[X(C11H15NO2)]
method: RPBEPBE
basis: SDD
operation: Freq
keyword: #p
keyword: freq=noraman
keyword: PBEPBE/SDD
title: #p freq=noraman PBEPBE/SDD
converged: YES YES NO NO
title: Mulliken charges:
elementType: O O N C C C C C C C C C C C H H H H H H H H H H H H H H H
charge: -0.417140 -0.231029 -0.562065 -0.408341 -0.340641 -0.556058 -0.223995 0.502569 0.137659 -0.424879 -0.404630 -0.225411 -0.230610 -0.243881 0.230018 0.216840 0.224303 0.215132 0.206586 0.204497 0.258353 0.230610 0.232065 0.277250 0.284136 0.222655 0.222835 0.226671 0.376503
chargesum: 0.00000
title: Mulliken charges with hydrogens summed into heavy atoms:
elementType: O O N C C C C C C C C C C C
charge: -0.040637 -0.231029 -0.000678 0.038517 0.098794 -0.144975 0.034358 0.502569 0.137659 -0.194270 -0.172565 -0.002757 -0.007776 -0.017210
polarizability: 1.48119369e+02 3.33626781e+00 1.29152067e+02 2.18511737e+01 -5.29112278e+00 1.01842311e+02
1716.lowfreq: -13.9228 -5.4666 -0.0005 0.0007 0.0008 5.1790 11.0920 22.7345 36.4957
frequency: 10.2862 22.7000 36.4845 55.6319 67.9448 113.7407 158.5101 201.1925 213.6689 256.9012 280.7248 333.1866 336.6223 402.4535 402.9993 482.3765 517.1820 566.2018 586.4610 617.6771 624.9778 686.1279 705.0998 719.6376 737.9816 760.1430 776.4154 808.3514 850.7438 856.7714 915.0965 930.8431 975.3704 989.8983 992.8871 1016.5783 1023.2693 1026.0403 1035.5201 1048.1758 1091.6817 1132.4562 1150.1485 1171.3703 1186.4121 1191.3103 1216.4322 1226.9262 1259.2563 1274.7092 1287.4335 1303.4333 1325.8909 1331.1356 1358.8379 1362.8239 1382.3184 1440.0341 1449.5302 1467.0776 1483.4007 1483.6849 1592.9492 1614.4231 1652.7917 1656.7050 2972.7480 2981.1776 2995.0820 3018.6906 3028.4964 3041.7989 3066.3775 3112.9910 3114.6656 3130.4666 3142.2378 3161.1415 3456.2666 3500.7968 3573.8849
redmass: 3.9541 5.1807 9.4257 4.5838 3.7016 2.1754 3.7848 1.1524 3.5189 3.9221 3.4367 2.3003 2.8070 3.3173 3.2993 3.2471 2.7565 3.3976 3.0354 6.3551 1.5770 1.6918 1.7576 3.4135 1.3438 1.7882 2.2860 3.5682 1.3972 1.4071 1.5010 2.5917 1.3873 6.2744 1.3203 2.9666 2.8526 2.2216 2.0607 1.9510 1.5672 1.3447 1.5140 1.0524 1.1157 1.9680 2.3807 1.4481 1.5176 1.3264 1.4521 1.2014 1.2980 1.3382 1.4398 1.4427 7.7800 2.1724 1.0842 1.1026 1.1365 2.1564 6.0451 6.1784 1.5234 2.6679 1.0590 1.0597 1.0595 1.0993 1.0841 1.1034 1.1045 1.0869 1.0868 1.0907 1.0958 1.1015 1.0455 1.0641 1.0963
irintensity: 0.0202 0.6181 1.4351 0.0487 0.2016 0.2707 2.6676 66.9982 2.2637 6.1378 4.7817 8.8818 14.0135 10.4523 10.4958 12.2362 33.8691 14.9913 35.7013 0.0335 90.9954 231.3306 49.4873 15.7411 23.2062 50.0045 0.8702 1.2131 4.2015 4.5173 1.7104 4.1635 0.0747 0.1658 0.0623 10.0861 212.6308 13.1109 10.7481 17.9687 12.3497 5.9132 11.0559 0.1188 0.3091 8.9571 0.0752 2.2210 7.9061 9.2097 6.8633 0.3678 1.1575 0.9132 1.2280 3.5732 0.1135 6.5244 4.0714 0.2873 14.3404 16.6387 1.3890 10.2215 13.8567 236.0988 6.7039 30.4020 42.3852 1.2994 25.4124 10.2723 52.0496 9.3155 7.8363 11.4442 47.2791 23.6881 1.0363 12.0005 2.3158
temp: 298.150 k
press: 1.00000 atm
elementType: 8 8 7 6 6 6 6 6 6 6 6 6 6 6 1 1 1 1 1 1 1 1 1 1 1 1 1 1 1
symmnumber: 1
zpe: 631226.7 jmol-1
zpe.correction: 0.240422 hartree
zpe.thermalcorrener: 0.254853 hartree
zpe.thermalcorrenthalpy: 0.255798 hartree
zpe.thermalcorrgfe: 0.195322 hartree
zpe.sumelectzpe: -632.314200 hartree
zpe.sumelectthermal: -632.299768 hartree
zpe.sumelectthermalent: -632.298824 hartree
zpe.sumelectthermalfe: -632.359300 hartree
dipole: -0.7941 0.4975 -0.8137
dipole: 1.2411
quadrupole: -77.0399 -76.9791 -88.6761
quadrupole: -0.9898 5.0031 -3.6492
quadrupole: 3.8585 3.9193 -7.7777 -0.9898 5.0031 -3.6492
hfenergy: -632.5546217 hartree
pointgroup: C01 [X(C11H15N1O2)]
dipole: -0.306077 -0.1452537 0.3516103 debye
polarizability: 147.2340433|-6.7720287|127.0493259|-21.9920589|-8.8553989|104.8303768 unknown
InChI: InChI=1S/C11H15NO2/c12-10(11(13)14)8-4-7-9-5-2-1-3-6-9/h1-3,5-6,10,13H,4,7-8,12H2
charge 0 multiplicity 1
29 atoms
O  -3.89349 -1.46134 0.825749
O  -3.352807 -1.125701 -1.408299
N  -3.12595 1.727078 -0.934967
C  -0.628113 0.480713 0.337881
C  -1.93396 0.83931 1.079427
C  0.602868 0.543402 1.285389
C  -3.213168 0.79042 0.190061
C  1.906658 0.213684 0.573042
C  -3.48095 -0.663385 -0.253602
C  2.458724 -1.092008 0.625736
C  2.580489 1.199318 -0.195107
C  3.64831 -1.40748 -0.070144
C  3.769711 0.890185 -0.892224
C  4.308295 -0.416679 -0.832869
H  -0.692609 -0.534627 -0.101523
H  -0.463094 1.183865 -0.501471
H  -1.862877 1.871207 1.471806
H  -2.077112 0.158021 1.940031
H  0.65452 1.559949 1.724129
H  0.440184 -0.160255 2.125268
H  -4.063727 1.087907 0.831217
H  1.954209 -1.86493 1.219342
H  2.172056 2.217129 -0.240871
H  -4.032254 1.937289 -1.365276
H  -2.445432 1.43902 -1.646651
H  4.061025 -2.421454 -0.014793
H  4.277971 1.665729 -1.476815
H  5.231925 -0.658153 -1.370918
H  -4.043902 -2.394414 0.510953
