program: Gaussian 09
title: 000296865
version: EM64L-G09RevD.01
frameworkgroup: C1[X(C10H9N3O)]
method: RPBEPBE
basis: SDD
operation: Freq
keyword: #p
keyword: freq=noraman
keyword: PBEPBE/SDD
title: #p freq=noraman PBEPBE/SDD
converged: YES YES NO NO
title: Mulliken charges:
elementType: O N N N C C C C C C C C C C H H H H H H H H H
charge: -0.236092 -0.483982 -0.457440 -0.013578 0.449812 0.449081 -0.430012 -0.407869 -0.379144 -0.192366 -0.205479 -0.245810 0.016230 -0.252647 0.322322 0.241733 0.281104 0.361385 0.232425 0.235244 0.238622 0.239003 0.237459
chargesum: 0.00000
title: Mulliken charges with hydrogens summed into heavy atoms:
elementType: O N N N C C C C C C C C C C
charge: -0.236092 -0.161660 -0.096055 -0.013578 0.449812 0.449081 -0.188279 -0.126765 -0.146719 0.042878 0.033143 -0.006807 0.016230 -0.015188
polarizability: 2.13739301e+02 -7.16797443e+00 1.37155445e+02 9.93613892e+00 5.02008990e+00 6.82859236e+01
1716.lowfreq: -10.2777 -3.7238 0.0007 0.0008 0.0009 7.6665 45.0612 50.8830 83.1844
frequency: 45.0247 50.8289 83.1768 144.8935 194.7640 208.3477 298.5094 324.0237 407.2652 428.4318 462.4485 487.3863 524.2056 556.8560 561.7990 612.5316 625.9717 656.5782 692.2677 716.9156 744.2464 756.1196 766.0649 784.0383 836.6876 853.6972 900.3903 918.3540 949.0300 975.4875 986.8104 996.1413 1005.0394 1019.2372 1026.0400 1089.4733 1101.5564 1175.7817 1190.7434 1223.3284 1275.7705 1310.9885 1342.4457 1357.5286 1382.0387 1427.8582 1450.7669 1478.6641 1490.6941 1550.6207 1592.2673 1603.5865 1615.6510 1649.9169 3116.3475 3128.6808 3137.5549 3148.7259 3157.8836 3174.3213 3182.3291 3499.9000 3550.5312
redmass: 4.7216 5.1625 5.7779 5.4740 6.0497 5.0970 6.0936 3.8881 2.8771 2.8444 3.5604 3.2438 1.5757 7.0967 7.7896 6.1444 5.9778 3.8959 1.8140 1.8705 2.6668 1.8921 2.1472 2.4882 2.2631 1.8131 5.5642 1.3879 1.4253 1.4239 5.1698 1.3195 4.5656 4.4153 2.1366 1.5669 1.6941 1.0520 1.1096 2.8323 1.6280 1.6088 1.3029 1.7784 6.4992 2.5237 3.3890 1.8491 2.7437 5.1463 5.8642 4.1957 5.2761 7.8555 1.0907 1.0877 1.0870 1.0921 1.0964 1.1016 1.0952 1.0775 1.0763
irintensity: 1.4610 0.3899 4.2670 0.0347 3.5526 2.7559 2.3964 5.5191 2.6421 25.5738 25.6764 41.6016 49.1877 3.7559 2.4475 1.3035 0.6765 2.8712 67.3546 13.8957 6.3034 7.6409 139.0141 65.9125 3.7538 5.1632 21.4049 3.8169 0.7639 0.5734 0.3120 0.6514 1.3619 8.0947 9.1581 9.1794 17.1612 0.3258 3.6530 13.8953 44.1421 111.7591 23.9608 19.4719 10.2978 7.6878 82.4478 12.5009 85.3547 444.1488 220.6927 472.5800 48.3727 523.6802 35.5160 7.3254 1.1113 11.5010 20.5408 13.5441 4.5053 36.4161 35.6347
temp: 298.150 k
press: 1.00000 atm
elementType: 8 7 7 7 6 6 6 6 6 6 6 6 6 6 1 1 1 1 1 1 1 1 1
symmnumber: 1
zpe: 460595.6 jmol-1
zpe.correction: 0.175432 hartree
zpe.thermalcorrener: 0.186644 hartree
zpe.thermalcorrenthalpy: 0.187588 hartree
zpe.thermalcorrgfe: 0.137181 hartree
zpe.sumelectzpe: -624.966925 hartree
zpe.sumelectthermal: -624.955713 hartree
zpe.sumelectthermalent: -624.954769 hartree
zpe.sumelectthermalfe: -625.005176 hartree
dipole: -7.2424 -5.6524 0.9094
dipole: 9.2320
quadrupole: -93.1654 -78.8416 -83.0377
quadrupole: -17.0243 5.6898 4.8584
quadrupole: -8.1505 6.1733 1.9772 -17.0243 5.6898 4.8584
hfenergy: -625.1423566 hartree
pointgroup: C01 [X(C10H9N3O1)]
dipole: 2.9023283 2.1733163 0.2134583 debye
dipolederiv: -0.4214973 0.011241 0.0129718 -0.4774238 -1.3081481 -0.1710808 -0.0887194 -0.1638266 -0.4129862 -2.0923582 0.0943081 0.007619 -0.008667 -0.2762279 -0.0200976 0.0910306 -0.0398958 -0.3836402 -0.8365592 -0.4022829 -0.0668101 -0.2186792 -0.7167337 -0.1019917 0.0112579 -0.0706175 -0.2414394 -0.3877053 0.3434858 0.073328 -0.6995103 -1.1116936 -0.1578104 -0.1007896 -0.1593235 -0.3097246 1.1958163 -0.3104965 -0.0244267 -0.7936616 0.2095598 -0.0539992 -0.1269925 -0.0000737 0.1153913 2.2650971 0.083898 0.0095045 -0.0073207 0.5592348 0.149239 -0.340132 0.1312986 0.2570881 -0.4127416 0.065968 -0.0298563 -0.0385619 -0.0073583 -0.090587 0.0301005 -0.130372 -0.1050925 -0.1948473 -0.0182817 -0.0551161 0.2790797 -0.1815117 -0.0445846 -0.1312493 -0.0357192 -0.0962906 -1.5438411 -0.1584388 -0.0146212 0.2821556 -0.2180356 0.008883 0.0601985 0.0321698 -0.2964283 0.1242971 -0.0184562 -0.0723166 -0.0081517 0.015613 -0.0967861 -0.140307 -0.0843904 -0.0289135 0.0656992 -0.0082444 -0.0577043 -0.0776313 0.0853781 -0.1168696 0.0136167 -0.1252761 -0.0280856 -0.0727246 -0.0984155 -0.006657 -0.0437936 -0.0958978 -0.0076837 -0.0059571 0.0029104 -0.1739091 0.7225109 0.0493829 -0.03886 0.814917 1.8259556 0.2834938 0.114205 0.2617392 0.2946738 1.1178609 0.1840324 0.006715 0.6901413 0.774002 0.1335188 0.06666 0.1212725 0.0265465 0.091266 0.0265954 0.0119188 0.0692726 0.1595119 0.0134049 0.1872094 -0.0020044 0.3197147 0.1075068 0.0623495 -0.0054359 0.0460455 -0.0185512 0.1121675 0.0064083 0.1067328 0.0869292 0.0093526 -0.018572 0.088907 -0.0340035 0.0933828 0.0355244 0.1093801 0.0370999 0.0913089 0.2309948 0.0081878 0.0145865 0.0386548 0.1597833 -0.0085716 0.0858254 0.0050373 0.275138 0.0733896 -0.0803461 -0.0057271 -0.0413125 -0.0482649 -0.0494083 0.0032326 -0.0530399 0.2009774 -0.0395558 -0.042155 0.0928902 -0.0436925 0.0814681 0.0663513 0.1127888 0.0578366 0.0805602 0.0796329 0.0138676 0.0116092 0.0414806 -0.0177773 0.1119367 -0.0123269 0.107844 0.0790354 -0.0571015 0.092532 0.0203209 0.1040978 0.0604035 0.035348 0.0212585 0.0268565 0.1433262 -0.0244925 0.1198408 0.0271605 0.1265647 -0.0240928 -0.030397 0.0333011 -0.0262585 0.1058205 unknown
polarizability: 213.1683513|-9.5414883|136.815485|-10.9474675|-8.3812132|69.1968333 unknown
InChI: InChI=1S/C10H9N3O/c14-10-11-7-6-9(13-10)12-8-4-2-1-3-5-8/h1-7,12-13H
charge 0 multiplicity 1
23 atoms
O  -2.715244 -2.293496 -0.392239
N  0.30813 1.30681 0.058606
N  -1.27782 -0.478915 -0.15599
N  -3.683881 -0.170206 0.034797
C  1.513326 0.536548 0.053281
C  -1.003688 0.851152 0.074931
C  2.622283 1.01973 -0.6891
C  1.642846 -0.656539 0.814368
C  -2.098717 1.710352 0.282776
C  3.843434 0.313893 -0.676074
C  2.862927 -1.366904 0.799151
C  3.967596 -0.888962 0.05775
C  -2.621011 -1.0565 -0.178886
C  -3.397941 1.130964 0.242791
H  0.413367 2.321508 0.010555
H  2.52099 1.93524 -1.283901
H  0.820397 -1.004696 1.4479
H  -0.526862 -1.143347 -0.369672
H  -1.954306 2.773757 0.48339
H  4.693389 0.696844 -1.25096
H  2.952477 -2.286992 1.386444
H  4.912493 -1.441553 0.056536
H  -4.267486 1.781911 0.402048
